(view as text)
Determining if the pthread_create exist failed with the following output:
Change Dir: /home/vagrant/slave/monero-static-ubuntu-amd64/build/build/release/CMakeFiles/CMakeTmp

Run Build Command:"/usr/bin/make" "cmTC_4ab02/fast"
make[1]: Entering directory '/home/vagrant/slave/monero-static-ubuntu-amd64/build/build/release/CMakeFiles/CMakeTmp'
/usr/bin/make -f CMakeFiles/cmTC_4ab02.dir/build.make CMakeFiles/cmTC_4ab02.dir/build
make[2]: Entering directory '/home/vagrant/slave/monero-static-ubuntu-amd64/build/build/release/CMakeFiles/CMakeTmp'
Building C object CMakeFiles/cmTC_4ab02.dir/CheckSymbolExists.c.o
/usr/bin/cc     -o CMakeFiles/cmTC_4ab02.dir/CheckSymbolExists.c.o   -c /home/vagrant/slave/monero-static-ubuntu-amd64/build/build/release/CMakeFiles/CMakeTmp/CheckSymbolExists.c
Linking C executable cmTC_4ab02
/usr/bin/cmake -E cmake_link_script CMakeFiles/cmTC_4ab02.dir/link.txt --verbose=1
/usr/bin/cc       CMakeFiles/cmTC_4ab02.dir/CheckSymbolExists.c.o  -o cmTC_4ab02 -rdynamic 
CMakeFiles/cmTC_4ab02.dir/CheckSymbolExists.c.o: In function `main':
CheckSymbolExists.c:(.text+0x16): undefined reference to `pthread_create'
collect2: error: ld returned 1 exit status
CMakeFiles/cmTC_4ab02.dir/build.make:97: recipe for target 'cmTC_4ab02' failed
make[2]: *** [cmTC_4ab02] Error 1
make[2]: Leaving directory '/home/vagrant/slave/monero-static-ubuntu-amd64/build/build/release/CMakeFiles/CMakeTmp'
Makefile:126: recipe for target 'cmTC_4ab02/fast' failed
make[1]: *** [cmTC_4ab02/fast] Error 2
make[1]: Leaving directory '/home/vagrant/slave/monero-static-ubuntu-amd64/build/build/release/CMakeFiles/CMakeTmp'

File /home/vagrant/slave/monero-static-ubuntu-amd64/build/build/release/CMakeFiles/CMakeTmp/CheckSymbolExists.c:
/* */
#include <pthread.h>

int main(int argc, char** argv)
{
  (void)argv;
#ifndef pthread_create
  return ((int*)(&pthread_create))[argc];
#else
  (void)argc;
  return 0;
#endif
}

Determining if the function memset_s exists in the c failed with the following output:
Change Dir: /home/vagrant/slave/monero-static-ubuntu-amd64/build/build/release/CMakeFiles/CMakeTmp

Run Build Command:"/usr/bin/make" "cmTC_945e3/fast"
make[1]: Entering directory '/home/vagrant/slave/monero-static-ubuntu-amd64/build/build/release/CMakeFiles/CMakeTmp'
/usr/bin/make -f CMakeFiles/cmTC_945e3.dir/build.make CMakeFiles/cmTC_945e3.dir/build
make[2]: Entering directory '/home/vagrant/slave/monero-static-ubuntu-amd64/build/build/release/CMakeFiles/CMakeTmp'
Building C object CMakeFiles/cmTC_945e3.dir/CheckFunctionExists.c.o
/usr/bin/cc    -pthread -DCHECK_FUNCTION_EXISTS=memset_s   -o CMakeFiles/cmTC_945e3.dir/CheckFunctionExists.c.o   -c /usr/share/cmake-3.5/Modules/CheckFunctionExists.c
Linking C executable cmTC_945e3
/usr/bin/cmake -E cmake_link_script CMakeFiles/cmTC_945e3.dir/link.txt --verbose=1
/usr/bin/cc   -pthread -DCHECK_FUNCTION_EXISTS=memset_s    CMakeFiles/cmTC_945e3.dir/CheckFunctionExists.c.o  -o cmTC_945e3  -L/home/vagrant/slave/monero-static-ubuntu-amd64/build/build/release/CMakeFiles/CMakeTmp/string.h -rdynamic -lc -Wl,-rpath,/home/vagrant/slave/monero-static-ubuntu-amd64/build/build/release/CMakeFiles/CMakeTmp/string.h 
CMakeFiles/cmTC_945e3.dir/CheckFunctionExists.c.o: In function `main':
CheckFunctionExists.c:(.text+0x15): undefined reference to `memset_s'
collect2: error: ld returned 1 exit status
CMakeFiles/cmTC_945e3.dir/build.make:97: recipe for target 'cmTC_945e3' failed
make[2]: *** [cmTC_945e3] Error 1
make[2]: Leaving directory '/home/vagrant/slave/monero-static-ubuntu-amd64/build/build/release/CMakeFiles/CMakeTmp'
Makefile:126: recipe for target 'cmTC_945e3/fast' failed
make[1]: *** [cmTC_945e3/fast] Error 2
make[1]: Leaving directory '/home/vagrant/slave/monero-static-ubuntu-amd64/build/build/release/CMakeFiles/CMakeTmp'


Determining if the function explicit_bzero exists in the c failed with the following output:
Change Dir: /home/vagrant/slave/monero-static-ubuntu-amd64/build/build/release/CMakeFiles/CMakeTmp

Run Build Command:"/usr/bin/make" "cmTC_2c12c/fast"
make[1]: Entering directory '/home/vagrant/slave/monero-static-ubuntu-amd64/build/build/release/CMakeFiles/CMakeTmp'
/usr/bin/make -f CMakeFiles/cmTC_2c12c.dir/build.make CMakeFiles/cmTC_2c12c.dir/build
make[2]: Entering directory '/home/vagrant/slave/monero-static-ubuntu-amd64/build/build/release/CMakeFiles/CMakeTmp'
Building C object CMakeFiles/cmTC_2c12c.dir/CheckFunctionExists.c.o
/usr/bin/cc    -pthread -DCHECK_FUNCTION_EXISTS=explicit_bzero   -o CMakeFiles/cmTC_2c12c.dir/CheckFunctionExists.c.o   -c /usr/share/cmake-3.5/Modules/CheckFunctionExists.c
Linking C executable cmTC_2c12c
/usr/bin/cmake -E cmake_link_script CMakeFiles/cmTC_2c12c.dir/link.txt --verbose=1
/usr/bin/cc   -pthread -DCHECK_FUNCTION_EXISTS=explicit_bzero    CMakeFiles/cmTC_2c12c.dir/CheckFunctionExists.c.o  -o cmTC_2c12c  -L/home/vagrant/slave/monero-static-ubuntu-amd64/build/build/release/CMakeFiles/CMakeTmp/strings.h -rdynamic -lc -Wl,-rpath,/home/vagrant/slave/monero-static-ubuntu-amd64/build/build/release/CMakeFiles/CMakeTmp/strings.h 
CMakeFiles/cmTC_2c12c.dir/CheckFunctionExists.c.o: In function `main':
CheckFunctionExists.c:(.text+0x15): undefined reference to `explicit_bzero'
collect2: error: ld returned 1 exit status
CMakeFiles/cmTC_2c12c.dir/build.make:97: recipe for target 'cmTC_2c12c' failed
make[2]: *** [cmTC_2c12c] Error 1
make[2]: Leaving directory '/home/vagrant/slave/monero-static-ubuntu-amd64/build/build/release/CMakeFiles/CMakeTmp'
Makefile:126: recipe for target 'cmTC_2c12c/fast' failed
make[1]: *** [cmTC_2c12c/fast] Error 2
make[1]: Leaving directory '/home/vagrant/slave/monero-static-ubuntu-amd64/build/build/release/CMakeFiles/CMakeTmp'


Determining if the include file iphlpapi.h exists failed with the following output:
Change Dir: /home/vagrant/slave/monero-static-ubuntu-amd64/build/build/release/CMakeFiles/CMakeTmp

Run Build Command:"/usr/bin/make" "cmTC_18875/fast"
make[1]: Entering directory '/home/vagrant/slave/monero-static-ubuntu-amd64/build/build/release/CMakeFiles/CMakeTmp'
/usr/bin/make -f CMakeFiles/cmTC_18875.dir/build.make CMakeFiles/cmTC_18875.dir/build
make[2]: Entering directory '/home/vagrant/slave/monero-static-ubuntu-amd64/build/build/release/CMakeFiles/CMakeTmp'
Building C object CMakeFiles/cmTC_18875.dir/CheckIncludeFile.c.o
/usr/bin/cc    -pthread    -o CMakeFiles/cmTC_18875.dir/CheckIncludeFile.c.o   -c /home/vagrant/slave/monero-static-ubuntu-amd64/build/build/release/CMakeFiles/CMakeTmp/CheckIncludeFile.c
/home/vagrant/slave/monero-static-ubuntu-amd64/build/build/release/CMakeFiles/CMakeTmp/CheckIncludeFile.c:1:22: fatal error: iphlpapi.h: No such file or directory
compilation terminated.
CMakeFiles/cmTC_18875.dir/build.make:65: recipe for target 'CMakeFiles/cmTC_18875.dir/CheckIncludeFile.c.o' failed
make[2]: *** [CMakeFiles/cmTC_18875.dir/CheckIncludeFile.c.o] Error 1
make[2]: Leaving directory '/home/vagrant/slave/monero-static-ubuntu-amd64/build/build/release/CMakeFiles/CMakeTmp'
Makefile:126: recipe for target 'cmTC_18875/fast' failed
make[1]: *** [cmTC_18875/fast] Error 2
make[1]: Leaving directory '/home/vagrant/slave/monero-static-ubuntu-amd64/build/build/release/CMakeFiles/CMakeTmp'


Determining if the include file login_cap.h exists failed with the following output:
Change Dir: /home/vagrant/slave/monero-static-ubuntu-amd64/build/build/release/CMakeFiles/CMakeTmp

Run Build Command:"/usr/bin/make" "cmTC_e80de/fast"
make[1]: Entering directory '/home/vagrant/slave/monero-static-ubuntu-amd64/build/build/release/CMakeFiles/CMakeTmp'
/usr/bin/make -f CMakeFiles/cmTC_e80de.dir/build.make CMakeFiles/cmTC_e80de.dir/build
make[2]: Entering directory '/home/vagrant/slave/monero-static-ubuntu-amd64/build/build/release/CMakeFiles/CMakeTmp'
Building C object CMakeFiles/cmTC_e80de.dir/CheckIncludeFile.c.o
/usr/bin/cc    -pthread    -o CMakeFiles/cmTC_e80de.dir/CheckIncludeFile.c.o   -c /home/vagrant/slave/monero-static-ubuntu-amd64/build/build/release/CMakeFiles/CMakeTmp/CheckIncludeFile.c
/home/vagrant/slave/monero-static-ubuntu-amd64/build/build/release/CMakeFiles/CMakeTmp/CheckIncludeFile.c:1:23: fatal error: login_cap.h: No such file or directory
compilation terminated.
CMakeFiles/cmTC_e80de.dir/build.make:65: recipe for target 'CMakeFiles/cmTC_e80de.dir/CheckIncludeFile.c.o' failed
make[2]: *** [CMakeFiles/cmTC_e80de.dir/CheckIncludeFile.c.o] Error 1
make[2]: Leaving directory '/home/vagrant/slave/monero-static-ubuntu-amd64/build/build/release/CMakeFiles/CMakeTmp'
Makefile:126: recipe for target 'cmTC_e80de/fast' failed
make[1]: *** [cmTC_e80de/fast] Error 2
make[1]: Leaving directory '/home/vagrant/slave/monero-static-ubuntu-amd64/build/build/release/CMakeFiles/CMakeTmp'


Determining if the include file sys/sha2.h exists failed with the following output:
Change Dir: /home/vagrant/slave/monero-static-ubuntu-amd64/build/build/release/CMakeFiles/CMakeTmp

Run Build Command:"/usr/bin/make" "cmTC_5221d/fast"
make[1]: Entering directory '/home/vagrant/slave/monero-static-ubuntu-amd64/build/build/release/CMakeFiles/CMakeTmp'
/usr/bin/make -f CMakeFiles/cmTC_5221d.dir/build.make CMakeFiles/cmTC_5221d.dir/build
make[2]: Entering directory '/home/vagrant/slave/monero-static-ubuntu-amd64/build/build/release/CMakeFiles/CMakeTmp'
Building C object CMakeFiles/cmTC_5221d.dir/CheckIncludeFile.c.o
/usr/bin/cc    -pthread    -o CMakeFiles/cmTC_5221d.dir/CheckIncludeFile.c.o   -c /home/vagrant/slave/monero-static-ubuntu-amd64/build/build/release/CMakeFiles/CMakeTmp/CheckIncludeFile.c
/home/vagrant/slave/monero-static-ubuntu-amd64/build/build/release/CMakeFiles/CMakeTmp/CheckIncludeFile.c:1:22: fatal error: sys/sha2.h: No such file or directory
compilation terminated.
CMakeFiles/cmTC_5221d.dir/build.make:65: recipe for target 'CMakeFiles/cmTC_5221d.dir/CheckIncludeFile.c.o' failed
make[2]: *** [CMakeFiles/cmTC_5221d.dir/CheckIncludeFile.c.o] Error 1
make[2]: Leaving directory '/home/vagrant/slave/monero-static-ubuntu-amd64/build/build/release/CMakeFiles/CMakeTmp'
Makefile:126: recipe for target 'cmTC_5221d/fast' failed
make[1]: *** [cmTC_5221d/fast] Error 2
make[1]: Leaving directory '/home/vagrant/slave/monero-static-ubuntu-amd64/build/build/release/CMakeFiles/CMakeTmp'


Determining if the include file vfork.h exists failed with the following output:
Change Dir: /home/vagrant/slave/monero-static-ubuntu-amd64/build/build/release/CMakeFiles/CMakeTmp

Run Build Command:"/usr/bin/make" "cmTC_3e451/fast"
make[1]: Entering directory '/home/vagrant/slave/monero-static-ubuntu-amd64/build/build/release/CMakeFiles/CMakeTmp'
/usr/bin/make -f CMakeFiles/cmTC_3e451.dir/build.make CMakeFiles/cmTC_3e451.dir/build
make[2]: Entering directory '/home/vagrant/slave/monero-static-ubuntu-amd64/build/build/release/CMakeFiles/CMakeTmp'
Building C object CMakeFiles/cmTC_3e451.dir/CheckIncludeFile.c.o
/usr/bin/cc    -pthread    -o CMakeFiles/cmTC_3e451.dir/CheckIncludeFile.c.o   -c /home/vagrant/slave/monero-static-ubuntu-amd64/build/build/release/CMakeFiles/CMakeTmp/CheckIncludeFile.c
/home/vagrant/slave/monero-static-ubuntu-amd64/build/build/release/CMakeFiles/CMakeTmp/CheckIncludeFile.c:1:19: fatal error: vfork.h: No such file or directory
compilation terminated.
CMakeFiles/cmTC_3e451.dir/build.make:65: recipe for target 'CMakeFiles/cmTC_3e451.dir/CheckIncludeFile.c.o' failed
make[2]: *** [CMakeFiles/cmTC_3e451.dir/CheckIncludeFile.c.o] Error 1
make[2]: Leaving directory '/home/vagrant/slave/monero-static-ubuntu-amd64/build/build/release/CMakeFiles/CMakeTmp'
Makefile:126: recipe for target 'cmTC_3e451/fast' failed
make[1]: *** [cmTC_3e451/fast] Error 2
make[1]: Leaving directory '/home/vagrant/slave/monero-static-ubuntu-amd64/build/build/release/CMakeFiles/CMakeTmp'


Determining if the include file windows.h exists failed with the following output:
Change Dir: /home/vagrant/slave/monero-static-ubuntu-amd64/build/build/release/CMakeFiles/CMakeTmp

Run Build Command:"/usr/bin/make" "cmTC_15767/fast"
make[1]: Entering directory '/home/vagrant/slave/monero-static-ubuntu-amd64/build/build/release/CMakeFiles/CMakeTmp'
/usr/bin/make -f CMakeFiles/cmTC_15767.dir/build.make CMakeFiles/cmTC_15767.dir/build
make[2]: Entering directory '/home/vagrant/slave/monero-static-ubuntu-amd64/build/build/release/CMakeFiles/CMakeTmp'
Building C object CMakeFiles/cmTC_15767.dir/CheckIncludeFile.c.o
/usr/bin/cc    -pthread    -o CMakeFiles/cmTC_15767.dir/CheckIncludeFile.c.o   -c /home/vagrant/slave/monero-static-ubuntu-amd64/build/build/release/CMakeFiles/CMakeTmp/CheckIncludeFile.c
/home/vagrant/slave/monero-static-ubuntu-amd64/build/build/release/CMakeFiles/CMakeTmp/CheckIncludeFile.c:1:21: fatal error: windows.h: No such file or directory
compilation terminated.
CMakeFiles/cmTC_15767.dir/build.make:65: recipe for target 'CMakeFiles/cmTC_15767.dir/CheckIncludeFile.c.o' failed
make[2]: *** [CMakeFiles/cmTC_15767.dir/CheckIncludeFile.c.o] Error 1
make[2]: Leaving directory '/home/vagrant/slave/monero-static-ubuntu-amd64/build/build/release/CMakeFiles/CMakeTmp'
Makefile:126: recipe for target 'cmTC_15767/fast' failed
make[1]: *** [cmTC_15767/fast] Error 2
make[1]: Leaving directory '/home/vagrant/slave/monero-static-ubuntu-amd64/build/build/release/CMakeFiles/CMakeTmp'


Determining if the include file winsock2.h exists failed with the following output:
Change Dir: /home/vagrant/slave/monero-static-ubuntu-amd64/build/build/release/CMakeFiles/CMakeTmp

Run Build Command:"/usr/bin/make" "cmTC_ba22e/fast"
make[1]: Entering directory '/home/vagrant/slave/monero-static-ubuntu-amd64/build/build/release/CMakeFiles/CMakeTmp'
/usr/bin/make -f CMakeFiles/cmTC_ba22e.dir/build.make CMakeFiles/cmTC_ba22e.dir/build
make[2]: Entering directory '/home/vagrant/slave/monero-static-ubuntu-amd64/build/build/release/CMakeFiles/CMakeTmp'
Building C object CMakeFiles/cmTC_ba22e.dir/CheckIncludeFile.c.o
/usr/bin/cc    -pthread    -o CMakeFiles/cmTC_ba22e.dir/CheckIncludeFile.c.o   -c /home/vagrant/slave/monero-static-ubuntu-amd64/build/build/release/CMakeFiles/CMakeTmp/CheckIncludeFile.c
/home/vagrant/slave/monero-static-ubuntu-amd64/build/build/release/CMakeFiles/CMakeTmp/CheckIncludeFile.c:1:22: fatal error: winsock2.h: No such file or directory
compilation terminated.
CMakeFiles/cmTC_ba22e.dir/build.make:65: recipe for target 'CMakeFiles/cmTC_ba22e.dir/CheckIncludeFile.c.o' failed
make[2]: *** [CMakeFiles/cmTC_ba22e.dir/CheckIncludeFile.c.o] Error 1
make[2]: Leaving directory '/home/vagrant/slave/monero-static-ubuntu-amd64/build/build/release/CMakeFiles/CMakeTmp'
Makefile:126: recipe for target 'cmTC_ba22e/fast' failed
make[1]: *** [cmTC_ba22e/fast] Error 2
make[1]: Leaving directory '/home/vagrant/slave/monero-static-ubuntu-amd64/build/build/release/CMakeFiles/CMakeTmp'


Determining if the include file ws2tcpip.h exists failed with the following output:
Change Dir: /home/vagrant/slave/monero-static-ubuntu-amd64/build/build/release/CMakeFiles/CMakeTmp

Run Build Command:"/usr/bin/make" "cmTC_468d1/fast"
make[1]: Entering directory '/home/vagrant/slave/monero-static-ubuntu-amd64/build/build/release/CMakeFiles/CMakeTmp'
/usr/bin/make -f CMakeFiles/cmTC_468d1.dir/build.make CMakeFiles/cmTC_468d1.dir/build
make[2]: Entering directory '/home/vagrant/slave/monero-static-ubuntu-amd64/build/build/release/CMakeFiles/CMakeTmp'
Building C object CMakeFiles/cmTC_468d1.dir/CheckIncludeFile.c.o
/usr/bin/cc    -pthread    -o CMakeFiles/cmTC_468d1.dir/CheckIncludeFile.c.o   -c /home/vagrant/slave/monero-static-ubuntu-amd64/build/build/release/CMakeFiles/CMakeTmp/CheckIncludeFile.c
/home/vagrant/slave/monero-static-ubuntu-amd64/build/build/release/CMakeFiles/CMakeTmp/CheckIncludeFile.c:1:22: fatal error: ws2tcpip.h: No such file or directory
compilation terminated.
CMakeFiles/cmTC_468d1.dir/build.make:65: recipe for target 'CMakeFiles/cmTC_468d1.dir/CheckIncludeFile.c.o' failed
make[2]: *** [CMakeFiles/cmTC_468d1.dir/CheckIncludeFile.c.o] Error 1
make[2]: Leaving directory '/home/vagrant/slave/monero-static-ubuntu-amd64/build/build/release/CMakeFiles/CMakeTmp'
Makefile:126: recipe for target 'cmTC_468d1/fast' failed
make[1]: *** [cmTC_468d1/fast] Error 2
make[1]: Leaving directory '/home/vagrant/slave/monero-static-ubuntu-amd64/build/build/release/CMakeFiles/CMakeTmp'


Determining if the function _beginthreadex exists failed with the following output:
Change Dir: /home/vagrant/slave/monero-static-ubuntu-amd64/build/build/release/CMakeFiles/CMakeTmp

Run Build Command:"/usr/bin/make" "cmTC_80cb5/fast"
make[1]: Entering directory '/home/vagrant/slave/monero-static-ubuntu-amd64/build/build/release/CMakeFiles/CMakeTmp'
/usr/bin/make -f CMakeFiles/cmTC_80cb5.dir/build.make CMakeFiles/cmTC_80cb5.dir/build
make[2]: Entering directory '/home/vagrant/slave/monero-static-ubuntu-amd64/build/build/release/CMakeFiles/CMakeTmp'
Building C object CMakeFiles/cmTC_80cb5.dir/CheckFunctionExists.c.o
/usr/bin/cc    -pthread -DCHECK_FUNCTION_EXISTS=_beginthreadex   -o CMakeFiles/cmTC_80cb5.dir/CheckFunctionExists.c.o   -c /usr/share/cmake-3.5/Modules/CheckFunctionExists.c
Linking C executable cmTC_80cb5
/usr/bin/cmake -E cmake_link_script CMakeFiles/cmTC_80cb5.dir/link.txt --verbose=1
/usr/bin/cc   -pthread -DCHECK_FUNCTION_EXISTS=_beginthreadex    CMakeFiles/cmTC_80cb5.dir/CheckFunctionExists.c.o  -o cmTC_80cb5 -rdynamic 
CMakeFiles/cmTC_80cb5.dir/CheckFunctionExists.c.o: In function `main':
CheckFunctionExists.c:(.text+0x15): undefined reference to `_beginthreadex'
collect2: error: ld returned 1 exit status
CMakeFiles/cmTC_80cb5.dir/build.make:97: recipe for target 'cmTC_80cb5' failed
make[2]: *** [cmTC_80cb5] Error 1
make[2]: Leaving directory '/home/vagrant/slave/monero-static-ubuntu-amd64/build/build/release/CMakeFiles/CMakeTmp'
Makefile:126: recipe for target 'cmTC_80cb5/fast' failed
make[1]: *** [cmTC_80cb5/fast] Error 2
make[1]: Leaving directory '/home/vagrant/slave/monero-static-ubuntu-amd64/build/build/release/CMakeFiles/CMakeTmp'


Determining if the function arc4random exists failed with the following output:
Change Dir: /home/vagrant/slave/monero-static-ubuntu-amd64/build/build/release/CMakeFiles/CMakeTmp

Run Build Command:"/usr/bin/make" "cmTC_efb72/fast"
make[1]: Entering directory '/home/vagrant/slave/monero-static-ubuntu-amd64/build/build/release/CMakeFiles/CMakeTmp'
/usr/bin/make -f CMakeFiles/cmTC_efb72.dir/build.make CMakeFiles/cmTC_efb72.dir/build
make[2]: Entering directory '/home/vagrant/slave/monero-static-ubuntu-amd64/build/build/release/CMakeFiles/CMakeTmp'
Building C object CMakeFiles/cmTC_efb72.dir/CheckFunctionExists.c.o
/usr/bin/cc    -pthread -DCHECK_FUNCTION_EXISTS=arc4random   -o CMakeFiles/cmTC_efb72.dir/CheckFunctionExists.c.o   -c /usr/share/cmake-3.5/Modules/CheckFunctionExists.c
Linking C executable cmTC_efb72
/usr/bin/cmake -E cmake_link_script CMakeFiles/cmTC_efb72.dir/link.txt --verbose=1
/usr/bin/cc   -pthread -DCHECK_FUNCTION_EXISTS=arc4random    CMakeFiles/cmTC_efb72.dir/CheckFunctionExists.c.o  -o cmTC_efb72 -rdynamic 
CMakeFiles/cmTC_efb72.dir/CheckFunctionExists.c.o: In function `main':
CheckFunctionExists.c:(.text+0x15): undefined reference to `arc4random'
collect2: error: ld returned 1 exit status
CMakeFiles/cmTC_efb72.dir/build.make:97: recipe for target 'cmTC_efb72' failed
make[2]: *** [cmTC_efb72] Error 1
make[2]: Leaving directory '/home/vagrant/slave/monero-static-ubuntu-amd64/build/build/release/CMakeFiles/CMakeTmp'
Makefile:126: recipe for target 'cmTC_efb72/fast' failed
make[1]: *** [cmTC_efb72/fast] Error 2
make[1]: Leaving directory '/home/vagrant/slave/monero-static-ubuntu-amd64/build/build/release/CMakeFiles/CMakeTmp'


Determining if the function arc4random_uniform exists failed with the following output:
Change Dir: /home/vagrant/slave/monero-static-ubuntu-amd64/build/build/release/CMakeFiles/CMakeTmp

Run Build Command:"/usr/bin/make" "cmTC_42dd0/fast"
make[1]: Entering directory '/home/vagrant/slave/monero-static-ubuntu-amd64/build/build/release/CMakeFiles/CMakeTmp'
/usr/bin/make -f CMakeFiles/cmTC_42dd0.dir/build.make CMakeFiles/cmTC_42dd0.dir/build
make[2]: Entering directory '/home/vagrant/slave/monero-static-ubuntu-amd64/build/build/release/CMakeFiles/CMakeTmp'
Building C object CMakeFiles/cmTC_42dd0.dir/CheckFunctionExists.c.o
/usr/bin/cc    -pthread -DCHECK_FUNCTION_EXISTS=arc4random_uniform   -o CMakeFiles/cmTC_42dd0.dir/CheckFunctionExists.c.o   -c /usr/share/cmake-3.5/Modules/CheckFunctionExists.c
Linking C executable cmTC_42dd0
/usr/bin/cmake -E cmake_link_script CMakeFiles/cmTC_42dd0.dir/link.txt --verbose=1
/usr/bin/cc   -pthread -DCHECK_FUNCTION_EXISTS=arc4random_uniform    CMakeFiles/cmTC_42dd0.dir/CheckFunctionExists.c.o  -o cmTC_42dd0 -rdynamic 
CMakeFiles/cmTC_42dd0.dir/CheckFunctionExists.c.o: In function `main':
CheckFunctionExists.c:(.text+0x15): undefined reference to `arc4random_uniform'
collect2: error: ld returned 1 exit status
CMakeFiles/cmTC_42dd0.dir/build.make:97: recipe for target 'cmTC_42dd0' failed
make[2]: *** [cmTC_42dd0] Error 1
make[2]: Leaving directory '/home/vagrant/slave/monero-static-ubuntu-amd64/build/build/release/CMakeFiles/CMakeTmp'
Makefile:126: recipe for target 'cmTC_42dd0/fast' failed
make[1]: *** [cmTC_42dd0/fast] Error 2
make[1]: Leaving directory '/home/vagrant/slave/monero-static-ubuntu-amd64/build/build/release/CMakeFiles/CMakeTmp'


Determining if the function getentropy exists failed with the following output:
Change Dir: /home/vagrant/slave/monero-static-ubuntu-amd64/build/build/release/CMakeFiles/CMakeTmp

Run Build Command:"/usr/bin/make" "cmTC_4d85b/fast"
make[1]: Entering directory '/home/vagrant/slave/monero-static-ubuntu-amd64/build/build/release/CMakeFiles/CMakeTmp'
/usr/bin/make -f CMakeFiles/cmTC_4d85b.dir/build.make CMakeFiles/cmTC_4d85b.dir/build
make[2]: Entering directory '/home/vagrant/slave/monero-static-ubuntu-amd64/build/build/release/CMakeFiles/CMakeTmp'
Building C object CMakeFiles/cmTC_4d85b.dir/CheckFunctionExists.c.o
/usr/bin/cc    -pthread -DCHECK_FUNCTION_EXISTS=getentropy   -o CMakeFiles/cmTC_4d85b.dir/CheckFunctionExists.c.o   -c /usr/share/cmake-3.5/Modules/CheckFunctionExists.c
Linking C executable cmTC_4d85b
/usr/bin/cmake -E cmake_link_script CMakeFiles/cmTC_4d85b.dir/link.txt --verbose=1
/usr/bin/cc   -pthread -DCHECK_FUNCTION_EXISTS=getentropy    CMakeFiles/cmTC_4d85b.dir/CheckFunctionExists.c.o  -o cmTC_4d85b -rdynamic 
CMakeFiles/cmTC_4d85b.dir/CheckFunctionExists.c.o: In function `main':
CheckFunctionExists.c:(.text+0x15): undefined reference to `getentropy'
collect2: error: ld returned 1 exit status
CMakeFiles/cmTC_4d85b.dir/build.make:97: recipe for target 'cmTC_4d85b' failed
make[2]: *** [cmTC_4d85b] Error 1
make[2]: Leaving directory '/home/vagrant/slave/monero-static-ubuntu-amd64/build/build/release/CMakeFiles/CMakeTmp'
Makefile:126: recipe for target 'cmTC_4d85b/fast' failed
make[1]: *** [cmTC_4d85b/fast] Error 2
make[1]: Leaving directory '/home/vagrant/slave/monero-static-ubuntu-amd64/build/build/release/CMakeFiles/CMakeTmp'


Determining if the function ioctlsocket exists failed with the following output:
Change Dir: /home/vagrant/slave/monero-static-ubuntu-amd64/build/build/release/CMakeFiles/CMakeTmp

Run Build Command:"/usr/bin/make" "cmTC_e8500/fast"
make[1]: Entering directory '/home/vagrant/slave/monero-static-ubuntu-amd64/build/build/release/CMakeFiles/CMakeTmp'
/usr/bin/make -f CMakeFiles/cmTC_e8500.dir/build.make CMakeFiles/cmTC_e8500.dir/build
make[2]: Entering directory '/home/vagrant/slave/monero-static-ubuntu-amd64/build/build/release/CMakeFiles/CMakeTmp'
Building C object CMakeFiles/cmTC_e8500.dir/CheckFunctionExists.c.o
/usr/bin/cc    -pthread -DCHECK_FUNCTION_EXISTS=ioctlsocket   -o CMakeFiles/cmTC_e8500.dir/CheckFunctionExists.c.o   -c /usr/share/cmake-3.5/Modules/CheckFunctionExists.c
Linking C executable cmTC_e8500
/usr/bin/cmake -E cmake_link_script CMakeFiles/cmTC_e8500.dir/link.txt --verbose=1
/usr/bin/cc   -pthread -DCHECK_FUNCTION_EXISTS=ioctlsocket    CMakeFiles/cmTC_e8500.dir/CheckFunctionExists.c.o  -o cmTC_e8500 -rdynamic 
CMakeFiles/cmTC_e8500.dir/CheckFunctionExists.c.o: In function `main':
CheckFunctionExists.c:(.text+0x15): undefined reference to `ioctlsocket'
collect2: error: ld returned 1 exit status
CMakeFiles/cmTC_e8500.dir/build.make:97: recipe for target 'cmTC_e8500' failed
make[2]: *** [cmTC_e8500] Error 1
make[2]: Leaving directory '/home/vagrant/slave/monero-static-ubuntu-amd64/build/build/release/CMakeFiles/CMakeTmp'
Makefile:126: recipe for target 'cmTC_e8500/fast' failed
make[1]: *** [cmTC_e8500/fast] Error 2
make[1]: Leaving directory '/home/vagrant/slave/monero-static-ubuntu-amd64/build/build/release/CMakeFiles/CMakeTmp'


Determining if the function reallocarray exists failed with the following output:
Change Dir: /home/vagrant/slave/monero-static-ubuntu-amd64/build/build/release/CMakeFiles/CMakeTmp

Run Build Command:"/usr/bin/make" "cmTC_96413/fast"
make[1]: Entering directory '/home/vagrant/slave/monero-static-ubuntu-amd64/build/build/release/CMakeFiles/CMakeTmp'
/usr/bin/make -f CMakeFiles/cmTC_96413.dir/build.make CMakeFiles/cmTC_96413.dir/build
make[2]: Entering directory '/home/vagrant/slave/monero-static-ubuntu-amd64/build/build/release/CMakeFiles/CMakeTmp'
Building C object CMakeFiles/cmTC_96413.dir/CheckFunctionExists.c.o
/usr/bin/cc    -pthread -DCHECK_FUNCTION_EXISTS=reallocarray   -o CMakeFiles/cmTC_96413.dir/CheckFunctionExists.c.o   -c /usr/share/cmake-3.5/Modules/CheckFunctionExists.c
Linking C executable cmTC_96413
/usr/bin/cmake -E cmake_link_script CMakeFiles/cmTC_96413.dir/link.txt --verbose=1
/usr/bin/cc   -pthread -DCHECK_FUNCTION_EXISTS=reallocarray    CMakeFiles/cmTC_96413.dir/CheckFunctionExists.c.o  -o cmTC_96413 -rdynamic 
CMakeFiles/cmTC_96413.dir/CheckFunctionExists.c.o: In function `main':
CheckFunctionExists.c:(.text+0x15): undefined reference to `reallocarray'
collect2: error: ld returned 1 exit status
CMakeFiles/cmTC_96413.dir/build.make:97: recipe for target 'cmTC_96413' failed
make[2]: *** [cmTC_96413] Error 1
make[2]: Leaving directory '/home/vagrant/slave/monero-static-ubuntu-amd64/build/build/release/CMakeFiles/CMakeTmp'
Makefile:126: recipe for target 'cmTC_96413/fast' failed
make[1]: *** [cmTC_96413/fast] Error 2
make[1]: Leaving directory '/home/vagrant/slave/monero-static-ubuntu-amd64/build/build/release/CMakeFiles/CMakeTmp'


Determining if the function setusercontent exists failed with the following output:
Change Dir: /home/vagrant/slave/monero-static-ubuntu-amd64/build/build/release/CMakeFiles/CMakeTmp

Run Build Command:"/usr/bin/make" "cmTC_645bb/fast"
make[1]: Entering directory '/home/vagrant/slave/monero-static-ubuntu-amd64/build/build/release/CMakeFiles/CMakeTmp'
/usr/bin/make -f CMakeFiles/cmTC_645bb.dir/build.make CMakeFiles/cmTC_645bb.dir/build
make[2]: Entering directory '/home/vagrant/slave/monero-static-ubuntu-amd64/build/build/release/CMakeFiles/CMakeTmp'
Building C object CMakeFiles/cmTC_645bb.dir/CheckFunctionExists.c.o
/usr/bin/cc    -pthread -DCHECK_FUNCTION_EXISTS=setusercontent   -o CMakeFiles/cmTC_645bb.dir/CheckFunctionExists.c.o   -c /usr/share/cmake-3.5/Modules/CheckFunctionExists.c
Linking C executable cmTC_645bb
/usr/bin/cmake -E cmake_link_script CMakeFiles/cmTC_645bb.dir/link.txt --verbose=1
/usr/bin/cc   -pthread -DCHECK_FUNCTION_EXISTS=setusercontent    CMakeFiles/cmTC_645bb.dir/CheckFunctionExists.c.o  -o cmTC_645bb -rdynamic 
CMakeFiles/cmTC_645bb.dir/CheckFunctionExists.c.o: In function `main':
CheckFunctionExists.c:(.text+0x15): undefined reference to `setusercontent'
collect2: error: ld returned 1 exit status
CMakeFiles/cmTC_645bb.dir/build.make:97: recipe for target 'cmTC_645bb' failed
make[2]: *** [cmTC_645bb] Error 1
make[2]: Leaving directory '/home/vagrant/slave/monero-static-ubuntu-amd64/build/build/release/CMakeFiles/CMakeTmp'
Makefile:126: recipe for target 'cmTC_645bb/fast' failed
make[1]: *** [cmTC_645bb/fast] Error 2
make[1]: Leaving directory '/home/vagrant/slave/monero-static-ubuntu-amd64/build/build/release/CMakeFiles/CMakeTmp'


Determining if the function strlcat exists failed with the following output:
Change Dir: /home/vagrant/slave/monero-static-ubuntu-amd64/build/build/release/CMakeFiles/CMakeTmp

Run Build Command:"/usr/bin/make" "cmTC_25742/fast"
make[1]: Entering directory '/home/vagrant/slave/monero-static-ubuntu-amd64/build/build/release/CMakeFiles/CMakeTmp'
/usr/bin/make -f CMakeFiles/cmTC_25742.dir/build.make CMakeFiles/cmTC_25742.dir/build
make[2]: Entering directory '/home/vagrant/slave/monero-static-ubuntu-amd64/build/build/release/CMakeFiles/CMakeTmp'
Building C object CMakeFiles/cmTC_25742.dir/CheckFunctionExists.c.o
/usr/bin/cc    -pthread -DCHECK_FUNCTION_EXISTS=strlcat   -o CMakeFiles/cmTC_25742.dir/CheckFunctionExists.c.o   -c /usr/share/cmake-3.5/Modules/CheckFunctionExists.c
Linking C executable cmTC_25742
/usr/bin/cmake -E cmake_link_script CMakeFiles/cmTC_25742.dir/link.txt --verbose=1
/usr/bin/cc   -pthread -DCHECK_FUNCTION_EXISTS=strlcat    CMakeFiles/cmTC_25742.dir/CheckFunctionExists.c.o  -o cmTC_25742 -rdynamic 
CMakeFiles/cmTC_25742.dir/CheckFunctionExists.c.o: In function `main':
CheckFunctionExists.c:(.text+0x15): undefined reference to `strlcat'
collect2: error: ld returned 1 exit status
CMakeFiles/cmTC_25742.dir/build.make:97: recipe for target 'cmTC_25742' failed
make[2]: *** [cmTC_25742] Error 1
make[2]: Leaving directory '/home/vagrant/slave/monero-static-ubuntu-amd64/build/build/release/CMakeFiles/CMakeTmp'
Makefile:126: recipe for target 'cmTC_25742/fast' failed
make[1]: *** [cmTC_25742/fast] Error 2
make[1]: Leaving directory '/home/vagrant/slave/monero-static-ubuntu-amd64/build/build/release/CMakeFiles/CMakeTmp'


Determining if the function strlcpy exists failed with the following output:
Change Dir: /home/vagrant/slave/monero-static-ubuntu-amd64/build/build/release/CMakeFiles/CMakeTmp

Run Build Command:"/usr/bin/make" "cmTC_e5c9a/fast"
make[1]: Entering directory '/home/vagrant/slave/monero-static-ubuntu-amd64/build/build/release/CMakeFiles/CMakeTmp'
/usr/bin/make -f CMakeFiles/cmTC_e5c9a.dir/build.make CMakeFiles/cmTC_e5c9a.dir/build
make[2]: Entering directory '/home/vagrant/slave/monero-static-ubuntu-amd64/build/build/release/CMakeFiles/CMakeTmp'
Building C object CMakeFiles/cmTC_e5c9a.dir/CheckFunctionExists.c.o
/usr/bin/cc    -pthread -DCHECK_FUNCTION_EXISTS=strlcpy   -o CMakeFiles/cmTC_e5c9a.dir/CheckFunctionExists.c.o   -c /usr/share/cmake-3.5/Modules/CheckFunctionExists.c
Linking C executable cmTC_e5c9a
/usr/bin/cmake -E cmake_link_script CMakeFiles/cmTC_e5c9a.dir/link.txt --verbose=1
/usr/bin/cc   -pthread -DCHECK_FUNCTION_EXISTS=strlcpy    CMakeFiles/cmTC_e5c9a.dir/CheckFunctionExists.c.o  -o cmTC_e5c9a -rdynamic 
CMakeFiles/cmTC_e5c9a.dir/CheckFunctionExists.c.o: In function `main':
CheckFunctionExists.c:(.text+0x15): undefined reference to `strlcpy'
collect2: error: ld returned 1 exit status
CMakeFiles/cmTC_e5c9a.dir/build.make:97: recipe for target 'cmTC_e5c9a' failed
make[2]: *** [cmTC_e5c9a] Error 1
make[2]: Leaving directory '/home/vagrant/slave/monero-static-ubuntu-amd64/build/build/release/CMakeFiles/CMakeTmp'
Makefile:126: recipe for target 'cmTC_e5c9a/fast' failed
make[1]: *** [cmTC_e5c9a/fast] Error 2
make[1]: Leaving directory '/home/vagrant/slave/monero-static-ubuntu-amd64/build/build/release/CMakeFiles/CMakeTmp'


Determining if the PTHREAD_PRIO_INHERIT exist failed with the following output:
Change Dir: /home/vagrant/slave/monero-static-ubuntu-amd64/build/build/release/CMakeFiles/CMakeTmp

Run Build Command:"/usr/bin/make" "cmTC_ff988/fast"
make[1]: Entering directory '/home/vagrant/slave/monero-static-ubuntu-amd64/build/build/release/CMakeFiles/CMakeTmp'
/usr/bin/make -f CMakeFiles/cmTC_ff988.dir/build.make CMakeFiles/cmTC_ff988.dir/build
make[2]: Entering directory '/home/vagrant/slave/monero-static-ubuntu-amd64/build/build/release/CMakeFiles/CMakeTmp'
Building C object CMakeFiles/cmTC_ff988.dir/CheckSymbolExists.c.o
/usr/bin/cc    -pthread    -o CMakeFiles/cmTC_ff988.dir/CheckSymbolExists.c.o   -c /home/vagrant/slave/monero-static-ubuntu-amd64/build/build/release/CMakeFiles/CMakeTmp/CheckSymbolExists.c
/home/vagrant/slave/monero-static-ubuntu-amd64/build/build/release/CMakeFiles/CMakeTmp/CheckSymbolExists.c: In function 'main':
/home/vagrant/slave/monero-static-ubuntu-amd64/build/build/release/CMakeFiles/CMakeTmp/CheckSymbolExists.c:8:18: error: lvalue required as unary '&' operand
   return ((int*)(&PTHREAD_PRIO_INHERIT))[argc];
                  ^
CMakeFiles/cmTC_ff988.dir/build.make:65: recipe for target 'CMakeFiles/cmTC_ff988.dir/CheckSymbolExists.c.o' failed
make[2]: *** [CMakeFiles/cmTC_ff988.dir/CheckSymbolExists.c.o] Error 1
make[2]: Leaving directory '/home/vagrant/slave/monero-static-ubuntu-amd64/build/build/release/CMakeFiles/CMakeTmp'
Makefile:126: recipe for target 'cmTC_ff988/fast' failed
make[1]: *** [cmTC_ff988/fast] Error 2
make[1]: Leaving directory '/home/vagrant/slave/monero-static-ubuntu-amd64/build/build/release/CMakeFiles/CMakeTmp'

File /home/vagrant/slave/monero-static-ubuntu-amd64/build/build/release/CMakeFiles/CMakeTmp/CheckSymbolExists.c:
/* */
#include <pthread.h>

int main(int argc, char** argv)
{
  (void)argv;
#ifndef PTHREAD_PRIO_INHERIT
  return ((int*)(&PTHREAD_PRIO_INHERIT))[argc];
#else
  (void)argc;
  return 0;
#endif
}

Determining if the pthread_rwlock_t exist failed with the following output:
Change Dir: /home/vagrant/slave/monero-static-ubuntu-amd64/build/build/release/CMakeFiles/CMakeTmp

Run Build Command:"/usr/bin/make" "cmTC_7a570/fast"
make[1]: Entering directory '/home/vagrant/slave/monero-static-ubuntu-amd64/build/build/release/CMakeFiles/CMakeTmp'
/usr/bin/make -f CMakeFiles/cmTC_7a570.dir/build.make CMakeFiles/cmTC_7a570.dir/build
make[2]: Entering directory '/home/vagrant/slave/monero-static-ubuntu-amd64/build/build/release/CMakeFiles/CMakeTmp'
Building C object CMakeFiles/cmTC_7a570.dir/CheckSymbolExists.c.o
/usr/bin/cc    -pthread    -o CMakeFiles/cmTC_7a570.dir/CheckSymbolExists.c.o   -c /home/vagrant/slave/monero-static-ubuntu-amd64/build/build/release/CMakeFiles/CMakeTmp/CheckSymbolExists.c
/home/vagrant/slave/monero-static-ubuntu-amd64/build/build/release/CMakeFiles/CMakeTmp/CheckSymbolExists.c: In function 'main':
/home/vagrant/slave/monero-static-ubuntu-amd64/build/build/release/CMakeFiles/CMakeTmp/CheckSymbolExists.c:8:19: error: expected expression before 'pthread_rwlock_t'
   return ((int*)(&pthread_rwlock_t))[argc];
                   ^
CMakeFiles/cmTC_7a570.dir/build.make:65: recipe for target 'CMakeFiles/cmTC_7a570.dir/CheckSymbolExists.c.o' failed
make[2]: *** [CMakeFiles/cmTC_7a570.dir/CheckSymbolExists.c.o] Error 1
make[2]: Leaving directory '/home/vagrant/slave/monero-static-ubuntu-amd64/build/build/release/CMakeFiles/CMakeTmp'
Makefile:126: recipe for target 'cmTC_7a570/fast' failed
make[1]: *** [cmTC_7a570/fast] Error 2
make[1]: Leaving directory '/home/vagrant/slave/monero-static-ubuntu-amd64/build/build/release/CMakeFiles/CMakeTmp'

File /home/vagrant/slave/monero-static-ubuntu-amd64/build/build/release/CMakeFiles/CMakeTmp/CheckSymbolExists.c:
/* */
#include <pthread.h>

int main(int argc, char** argv)
{
  (void)argv;
#ifndef pthread_rwlock_t
  return ((int*)(&pthread_rwlock_t))[argc];
#else
  (void)argc;
  return 0;
#endif
}

Determining if the pthread_spinlock_t exist failed with the following output:
Change Dir: /home/vagrant/slave/monero-static-ubuntu-amd64/build/build/release/CMakeFiles/CMakeTmp

Run Build Command:"/usr/bin/make" "cmTC_fe7bf/fast"
make[1]: Entering directory '/home/vagrant/slave/monero-static-ubuntu-amd64/build/build/release/CMakeFiles/CMakeTmp'
/usr/bin/make -f CMakeFiles/cmTC_fe7bf.dir/build.make CMakeFiles/cmTC_fe7bf.dir/build
make[2]: Entering directory '/home/vagrant/slave/monero-static-ubuntu-amd64/build/build/release/CMakeFiles/CMakeTmp'
Building C object CMakeFiles/cmTC_fe7bf.dir/CheckSymbolExists.c.o
/usr/bin/cc    -pthread    -o CMakeFiles/cmTC_fe7bf.dir/CheckSymbolExists.c.o   -c /home/vagrant/slave/monero-static-ubuntu-amd64/build/build/release/CMakeFiles/CMakeTmp/CheckSymbolExists.c
/home/vagrant/slave/monero-static-ubuntu-amd64/build/build/release/CMakeFiles/CMakeTmp/CheckSymbolExists.c: In function 'main':
/home/vagrant/slave/monero-static-ubuntu-amd64/build/build/release/CMakeFiles/CMakeTmp/CheckSymbolExists.c:8:19: error: expected expression before 'pthread_spinlock_t'
   return ((int*)(&pthread_spinlock_t))[argc];
                   ^
CMakeFiles/cmTC_fe7bf.dir/build.make:65: recipe for target 'CMakeFiles/cmTC_fe7bf.dir/CheckSymbolExists.c.o' failed
make[2]: *** [CMakeFiles/cmTC_fe7bf.dir/CheckSymbolExists.c.o] Error 1
make[2]: Leaving directory '/home/vagrant/slave/monero-static-ubuntu-amd64/build/build/release/CMakeFiles/CMakeTmp'
Makefile:126: recipe for target 'cmTC_fe7bf/fast' failed
make[1]: *** [cmTC_fe7bf/fast] Error 2
make[1]: Leaving directory '/home/vagrant/slave/monero-static-ubuntu-amd64/build/build/release/CMakeFiles/CMakeTmp'

File /home/vagrant/slave/monero-static-ubuntu-amd64/build/build/release/CMakeFiles/CMakeTmp/CheckSymbolExists.c:
/* */
#include <pthread.h>

int main(int argc, char** argv)
{
  (void)argv;
#ifndef pthread_spinlock_t
  return ((int*)(&pthread_spinlock_t))[argc];
#else
  (void)argc;
  return 0;
#endif
}

Determining if the function EVP_MD_CTX_new exists failed with the following output:
Change Dir: /home/vagrant/slave/monero-static-ubuntu-amd64/build/build/release/CMakeFiles/CMakeTmp

Run Build Command:"/usr/bin/make" "cmTC_c0bff/fast"
make[1]: Entering directory '/home/vagrant/slave/monero-static-ubuntu-amd64/build/build/release/CMakeFiles/CMakeTmp'
/usr/bin/make -f CMakeFiles/cmTC_c0bff.dir/build.make CMakeFiles/cmTC_c0bff.dir/build
make[2]: Entering directory '/home/vagrant/slave/monero-static-ubuntu-amd64/build/build/release/CMakeFiles/CMakeTmp'
Building C object CMakeFiles/cmTC_c0bff.dir/CheckFunctionExists.c.o
/usr/bin/cc    -pthread -DCHECK_FUNCTION_EXISTS=EVP_MD_CTX_new   -o CMakeFiles/cmTC_c0bff.dir/CheckFunctionExists.c.o   -c /usr/share/cmake-3.5/Modules/CheckFunctionExists.c
Linking C executable cmTC_c0bff
/usr/bin/cmake -E cmake_link_script CMakeFiles/cmTC_c0bff.dir/link.txt --verbose=1
/usr/bin/cc   -pthread -DCHECK_FUNCTION_EXISTS=EVP_MD_CTX_new    CMakeFiles/cmTC_c0bff.dir/CheckFunctionExists.c.o  -o cmTC_c0bff -rdynamic /usr/lib/x86_64-linux-gnu/libssl.a /usr/lib/x86_64-linux-gnu/libcrypto.a -ldl -pthread 
CMakeFiles/cmTC_c0bff.dir/CheckFunctionExists.c.o: In function `main':
CheckFunctionExists.c:(.text+0x15): undefined reference to `EVP_MD_CTX_new'
collect2: error: ld returned 1 exit status
CMakeFiles/cmTC_c0bff.dir/build.make:99: recipe for target 'cmTC_c0bff' failed
make[2]: *** [cmTC_c0bff] Error 1
make[2]: Leaving directory '/home/vagrant/slave/monero-static-ubuntu-amd64/build/build/release/CMakeFiles/CMakeTmp'
Makefile:126: recipe for target 'cmTC_c0bff/fast' failed
make[1]: *** [cmTC_c0bff/fast] Error 2
make[1]: Leaving directory '/home/vagrant/slave/monero-static-ubuntu-amd64/build/build/release/CMakeFiles/CMakeTmp'


Determining if the LIBRESSL_VERSION_TEXT exist failed with the following output:
Change Dir: /home/vagrant/slave/monero-static-ubuntu-amd64/build/build/release/CMakeFiles/CMakeTmp

Run Build Command:"/usr/bin/make" "cmTC_f7b2f/fast"
make[1]: Entering directory '/home/vagrant/slave/monero-static-ubuntu-amd64/build/build/release/CMakeFiles/CMakeTmp'
/usr/bin/make -f CMakeFiles/cmTC_f7b2f.dir/build.make CMakeFiles/cmTC_f7b2f.dir/build
make[2]: Entering directory '/home/vagrant/slave/monero-static-ubuntu-amd64/build/build/release/CMakeFiles/CMakeTmp'
Building C object CMakeFiles/cmTC_f7b2f.dir/CheckSymbolExists.c.o
/usr/bin/cc    -pthread    -o CMakeFiles/cmTC_f7b2f.dir/CheckSymbolExists.c.o   -c /home/vagrant/slave/monero-static-ubuntu-amd64/build/build/release/CMakeFiles/CMakeTmp/CheckSymbolExists.c
/home/vagrant/slave/monero-static-ubuntu-amd64/build/build/release/CMakeFiles/CMakeTmp/CheckSymbolExists.c: In function 'main':
/home/vagrant/slave/monero-static-ubuntu-amd64/build/build/release/CMakeFiles/CMakeTmp/CheckSymbolExists.c:8:19: error: 'LIBRESSL_VERSION_TEXT' undeclared (first use in this function)
   return ((int*)(&LIBRESSL_VERSION_TEXT))[argc];
                   ^
/home/vagrant/slave/monero-static-ubuntu-amd64/build/build/release/CMakeFiles/CMakeTmp/CheckSymbolExists.c:8:19: note: each undeclared identifier is reported only once for each function it appears in
CMakeFiles/cmTC_f7b2f.dir/build.make:65: recipe for target 'CMakeFiles/cmTC_f7b2f.dir/CheckSymbolExists.c.o' failed
make[2]: *** [CMakeFiles/cmTC_f7b2f.dir/CheckSymbolExists.c.o] Error 1
make[2]: Leaving directory '/home/vagrant/slave/monero-static-ubuntu-amd64/build/build/release/CMakeFiles/CMakeTmp'
Makefile:126: recipe for target 'cmTC_f7b2f/fast' failed
make[1]: *** [cmTC_f7b2f/fast] Error 2
make[1]: Leaving directory '/home/vagrant/slave/monero-static-ubuntu-amd64/build/build/release/CMakeFiles/CMakeTmp'

File /home/vagrant/slave/monero-static-ubuntu-amd64/build/build/release/CMakeFiles/CMakeTmp/CheckSymbolExists.c:
/* */
#include <openssl/opensslv.h>

int main(int argc, char** argv)
{
  (void)argv;
#ifndef LIBRESSL_VERSION_TEXT
  return ((int*)(&LIBRESSL_VERSION_TEXT))[argc];
#else
  (void)argc;
  return 0;
#endif
}

Performing C SOURCE FILE Test _fcf_protection=full_c failed with the following output:
Change Dir: /home/vagrant/slave/monero-static-ubuntu-amd64/build/build/release/CMakeFiles/CMakeTmp

Run Build Command:"/usr/bin/make" "cmTC_e005c/fast"
make[1]: Entering directory '/home/vagrant/slave/monero-static-ubuntu-amd64/build/build/release/CMakeFiles/CMakeTmp'
/usr/bin/make -f CMakeFiles/cmTC_e005c.dir/build.make CMakeFiles/cmTC_e005c.dir/build
make[2]: Entering directory '/home/vagrant/slave/monero-static-ubuntu-amd64/build/build/release/CMakeFiles/CMakeTmp'
Building C object CMakeFiles/cmTC_e005c.dir/src.c.o
/usr/bin/cc   -I/usr/local/include/libusb-1.0  -pthread -maes -march=x86-64 -fno-strict-aliasing -D_fcf_protection=full_c   -fcf-protection=full -o CMakeFiles/cmTC_e005c.dir/src.c.o   -c /home/vagrant/slave/monero-static-ubuntu-amd64/build/build/release/CMakeFiles/CMakeTmp/src.c
cc: error: unrecognized command line option '-fcf-protection=full'
CMakeFiles/cmTC_e005c.dir/build.make:65: recipe for target 'CMakeFiles/cmTC_e005c.dir/src.c.o' failed
make[2]: *** [CMakeFiles/cmTC_e005c.dir/src.c.o] Error 1
make[2]: Leaving directory '/home/vagrant/slave/monero-static-ubuntu-amd64/build/build/release/CMakeFiles/CMakeTmp'
Makefile:126: recipe for target 'cmTC_e005c/fast' failed
make[1]: *** [cmTC_e005c/fast] Error 2
make[1]: Leaving directory '/home/vagrant/slave/monero-static-ubuntu-amd64/build/build/release/CMakeFiles/CMakeTmp'

Source file was:
int main(void) { return 0; }
Performing C++ SOURCE FILE Test _fcf_protection=full_cxx failed with the following output:
Change Dir: /home/vagrant/slave/monero-static-ubuntu-amd64/build/build/release/CMakeFiles/CMakeTmp

Run Build Command:"/usr/bin/make" "cmTC_2b525/fast"
make[1]: Entering directory '/home/vagrant/slave/monero-static-ubuntu-amd64/build/build/release/CMakeFiles/CMakeTmp'
/usr/bin/make -f CMakeFiles/cmTC_2b525.dir/build.make CMakeFiles/cmTC_2b525.dir/build
make[2]: Entering directory '/home/vagrant/slave/monero-static-ubuntu-amd64/build/build/release/CMakeFiles/CMakeTmp'
Building CXX object CMakeFiles/cmTC_2b525.dir/src.cxx.o
/usr/bin/c++    -I/usr/local/include/libusb-1.0  -DZMQ_STATIC -pthread -maes -march=x86-64 -fno-strict-aliasing -D_fcf_protection=full_cxx   -fcf-protection=full -o CMakeFiles/cmTC_2b525.dir/src.cxx.o -c /home/vagrant/slave/monero-static-ubuntu-amd64/build/build/release/CMakeFiles/CMakeTmp/src.cxx
c++: error: unrecognized command line option '-fcf-protection=full'
CMakeFiles/cmTC_2b525.dir/build.make:65: recipe for target 'CMakeFiles/cmTC_2b525.dir/src.cxx.o' failed
make[2]: *** [CMakeFiles/cmTC_2b525.dir/src.cxx.o] Error 1
make[2]: Leaving directory '/home/vagrant/slave/monero-static-ubuntu-amd64/build/build/release/CMakeFiles/CMakeTmp'
Makefile:126: recipe for target 'cmTC_2b525/fast' failed
make[1]: *** [cmTC_2b525/fast] Error 2
make[1]: Leaving directory '/home/vagrant/slave/monero-static-ubuntu-amd64/build/build/release/CMakeFiles/CMakeTmp'

Source file was:
int main() { return 0; }
Performing C SOURCE FILE Test _fstack_clash_protection_c failed with the following output:
Change Dir: /home/vagrant/slave/monero-static-ubuntu-amd64/build/build/release/CMakeFiles/CMakeTmp

Run Build Command:"/usr/bin/make" "cmTC_98a6a/fast"
make[1]: Entering directory '/home/vagrant/slave/monero-static-ubuntu-amd64/build/build/release/CMakeFiles/CMakeTmp'
/usr/bin/make -f CMakeFiles/cmTC_98a6a.dir/build.make CMakeFiles/cmTC_98a6a.dir/build
make[2]: Entering directory '/home/vagrant/slave/monero-static-ubuntu-amd64/build/build/release/CMakeFiles/CMakeTmp'
Building C object CMakeFiles/cmTC_98a6a.dir/src.c.o
/usr/bin/cc   -I/usr/local/include/libusb-1.0  -pthread -maes -march=x86-64 -fno-strict-aliasing -D_fstack_clash_protection_c   -fstack-clash-protection -o CMakeFiles/cmTC_98a6a.dir/src.c.o   -c /home/vagrant/slave/monero-static-ubuntu-amd64/build/build/release/CMakeFiles/CMakeTmp/src.c
cc: error: unrecognized command line option '-fstack-clash-protection'
CMakeFiles/cmTC_98a6a.dir/build.make:65: recipe for target 'CMakeFiles/cmTC_98a6a.dir/src.c.o' failed
make[2]: *** [CMakeFiles/cmTC_98a6a.dir/src.c.o] Error 1
make[2]: Leaving directory '/home/vagrant/slave/monero-static-ubuntu-amd64/build/build/release/CMakeFiles/CMakeTmp'
Makefile:126: recipe for target 'cmTC_98a6a/fast' failed
make[1]: *** [cmTC_98a6a/fast] Error 2
make[1]: Leaving directory '/home/vagrant/slave/monero-static-ubuntu-amd64/build/build/release/CMakeFiles/CMakeTmp'

Source file was:
int main(void) { return 0; }
Performing C++ SOURCE FILE Test _fstack_clash_protection_cxx failed with the following output:
Change Dir: /home/vagrant/slave/monero-static-ubuntu-amd64/build/build/release/CMakeFiles/CMakeTmp

Run Build Command:"/usr/bin/make" "cmTC_ef637/fast"
make[1]: Entering directory '/home/vagrant/slave/monero-static-ubuntu-amd64/build/build/release/CMakeFiles/CMakeTmp'
/usr/bin/make -f CMakeFiles/cmTC_ef637.dir/build.make CMakeFiles/cmTC_ef637.dir/build
make[2]: Entering directory '/home/vagrant/slave/monero-static-ubuntu-amd64/build/build/release/CMakeFiles/CMakeTmp'
Building CXX object CMakeFiles/cmTC_ef637.dir/src.cxx.o
/usr/bin/c++    -I/usr/local/include/libusb-1.0  -DZMQ_STATIC -pthread -maes -march=x86-64 -fno-strict-aliasing -D_fstack_clash_protection_cxx   -fstack-clash-protection -o CMakeFiles/cmTC_ef637.dir/src.cxx.o -c /home/vagrant/slave/monero-static-ubuntu-amd64/build/build/release/CMakeFiles/CMakeTmp/src.cxx
c++: error: unrecognized command line option '-fstack-clash-protection'
CMakeFiles/cmTC_ef637.dir/build.make:65: recipe for target 'CMakeFiles/cmTC_ef637.dir/src.cxx.o' failed
make[2]: *** [CMakeFiles/cmTC_ef637.dir/src.cxx.o] Error 1
make[2]: Leaving directory '/home/vagrant/slave/monero-static-ubuntu-amd64/build/build/release/CMakeFiles/CMakeTmp'
Makefile:126: recipe for target 'cmTC_ef637/fast' failed
make[1]: *** [cmTC_ef637/fast] Error 2
make[1]: Leaving directory '/home/vagrant/slave/monero-static-ubuntu-amd64/build/build/release/CMakeFiles/CMakeTmp'

Source file was:
int main() { return 0; }
Performing C SOURCE FILE Test _mmitigate_rop_c failed with the following output:
Change Dir: /home/vagrant/slave/monero-static-ubuntu-amd64/build/build/release/CMakeFiles/CMakeTmp

Run Build Command:"/usr/bin/make" "cmTC_2e3e9/fast"
make[1]: Entering directory '/home/vagrant/slave/monero-static-ubuntu-amd64/build/build/release/CMakeFiles/CMakeTmp'
/usr/bin/make -f CMakeFiles/cmTC_2e3e9.dir/build.make CMakeFiles/cmTC_2e3e9.dir/build
make[2]: Entering directory '/home/vagrant/slave/monero-static-ubuntu-amd64/build/build/release/CMakeFiles/CMakeTmp'
Building C object CMakeFiles/cmTC_2e3e9.dir/src.c.o
/usr/bin/cc   -I/usr/local/include/libusb-1.0  -pthread -maes -march=x86-64 -fno-strict-aliasing -D_mmitigate_rop_c   -mmitigate-rop -o CMakeFiles/cmTC_2e3e9.dir/src.c.o   -c /home/vagrant/slave/monero-static-ubuntu-amd64/build/build/release/CMakeFiles/CMakeTmp/src.c
cc: error: unrecognized command line option '-mmitigate-rop'
CMakeFiles/cmTC_2e3e9.dir/build.make:65: recipe for target 'CMakeFiles/cmTC_2e3e9.dir/src.c.o' failed
make[2]: *** [CMakeFiles/cmTC_2e3e9.dir/src.c.o] Error 1
make[2]: Leaving directory '/home/vagrant/slave/monero-static-ubuntu-amd64/build/build/release/CMakeFiles/CMakeTmp'
Makefile:126: recipe for target 'cmTC_2e3e9/fast' failed
make[1]: *** [cmTC_2e3e9/fast] Error 2
make[1]: Leaving directory '/home/vagrant/slave/monero-static-ubuntu-amd64/build/build/release/CMakeFiles/CMakeTmp'

Source file was:
int main(void) { return 0; }
Performing C++ SOURCE FILE Test _mmitigate_rop_cxx failed with the following output:
Change Dir: /home/vagrant/slave/monero-static-ubuntu-amd64/build/build/release/CMakeFiles/CMakeTmp

Run Build Command:"/usr/bin/make" "cmTC_be2df/fast"
make[1]: Entering directory '/home/vagrant/slave/monero-static-ubuntu-amd64/build/build/release/CMakeFiles/CMakeTmp'
/usr/bin/make -f CMakeFiles/cmTC_be2df.dir/build.make CMakeFiles/cmTC_be2df.dir/build
make[2]: Entering directory '/home/vagrant/slave/monero-static-ubuntu-amd64/build/build/release/CMakeFiles/CMakeTmp'
Building CXX object CMakeFiles/cmTC_be2df.dir/src.cxx.o
/usr/bin/c++    -I/usr/local/include/libusb-1.0  -DZMQ_STATIC -pthread -maes -march=x86-64 -fno-strict-aliasing -D_mmitigate_rop_cxx   -mmitigate-rop -o CMakeFiles/cmTC_be2df.dir/src.cxx.o -c /home/vagrant/slave/monero-static-ubuntu-amd64/build/build/release/CMakeFiles/CMakeTmp/src.cxx
c++: error: unrecognized command line option '-mmitigate-rop'
CMakeFiles/cmTC_be2df.dir/build.make:65: recipe for target 'CMakeFiles/cmTC_be2df.dir/src.cxx.o' failed
make[2]: *** [CMakeFiles/cmTC_be2df.dir/src.cxx.o] Error 1
make[2]: Leaving directory '/home/vagrant/slave/monero-static-ubuntu-amd64/build/build/release/CMakeFiles/CMakeTmp'
Makefile:126: recipe for target 'cmTC_be2df/fast' failed
make[1]: *** [cmTC_be2df/fast] Error 2
make[1]: Leaving directory '/home/vagrant/slave/monero-static-ubuntu-amd64/build/build/release/CMakeFiles/CMakeTmp'

Source file was:
int main() { return 0; }
Determining if the -Wl,-z,noexecheap linker flag is supported failed with the following output:
Change Dir: /home/vagrant/slave/monero-static-ubuntu-amd64/build/build/release/CMakeFiles/CMakeTmp

Run Build Command:"/usr/bin/make" "cmTC_35ad2/fast"
make[1]: Entering directory '/home/vagrant/slave/monero-static-ubuntu-amd64/build/build/release/CMakeFiles/CMakeTmp'
/usr/bin/make -f CMakeFiles/cmTC_35ad2.dir/build.make CMakeFiles/cmTC_35ad2.dir/build
make[2]: Entering directory '/home/vagrant/slave/monero-static-ubuntu-amd64/build/build/release/CMakeFiles/CMakeTmp'
Building C object CMakeFiles/cmTC_35ad2.dir/CheckLinkerFlag.c.o
/usr/bin/cc    -Wl,-z,noexecheap    -Wl,-z,noexecheap -o CMakeFiles/cmTC_35ad2.dir/CheckLinkerFlag.c.o   -c /home/vagrant/slave/monero-static-ubuntu-amd64/build/cmake/CheckLinkerFlag.c
Linking C executable cmTC_35ad2
/usr/bin/cmake -E cmake_link_script CMakeFiles/cmTC_35ad2.dir/link.txt --verbose=1
/usr/bin/cc  -Wl,-z,noexecheap     CMakeFiles/cmTC_35ad2.dir/CheckLinkerFlag.c.o  -o cmTC_35ad2 -rdynamic 
/usr/bin/ld: warning: -z noexecheap ignored.
make[2]: Leaving directory '/home/vagrant/slave/monero-static-ubuntu-amd64/build/build/release/CMakeFiles/CMakeTmp'
make[1]: Leaving directory '/home/vagrant/slave/monero-static-ubuntu-amd64/build/build/release/CMakeFiles/CMakeTmp'


Determining if the function rl_copy_text exists failed with the following output:
Change Dir: /home/vagrant/slave/monero-static-ubuntu-amd64/build/build/release/CMakeFiles/CMakeTmp

Run Build Command:"/usr/bin/make" "cmTC_afe73/fast"
make[1]: Entering directory '/home/vagrant/slave/monero-static-ubuntu-amd64/build/build/release/CMakeFiles/CMakeTmp'
/usr/bin/make -f CMakeFiles/cmTC_afe73.dir/build.make CMakeFiles/cmTC_afe73.dir/build
make[2]: Entering directory '/home/vagrant/slave/monero-static-ubuntu-amd64/build/build/release/CMakeFiles/CMakeTmp'
Building C object CMakeFiles/cmTC_afe73.dir/CheckFunctionExists.c.o
/usr/bin/cc    -pthread -maes -march=x86-64 -fno-strict-aliasing -std=c11 -D_GNU_SOURCE   -Wall -Wextra -Wpointer-arith -Wundef -Wvla -Wwrite-strings -Wno-error=extra -Wno-error=deprecated-declarations -Wno-unused-parameter -Wno-unused-variable -Wno-error=unused-variable -Wno-error=undef -Wno-error=uninitialized -Wlogical-op -Wno-error=maybe-uninitialized -Wno-error=cpp -Waggregate-return -Wnested-externs -Wold-style-definition -Wstrict-prototypes  -fPIC  -Wformat -Wformat-security -fstack-protector -fstack-protector-strong -fno-strict-aliasing -DCHECK_FUNCTION_EXISTS=rl_copy_text   -o CMakeFiles/cmTC_afe73.dir/CheckFunctionExists.c.o   -c /usr/share/cmake-3.5/Modules/CheckFunctionExists.c
/usr/share/cmake-3.5/Modules/CheckFunctionExists.c:6:1: warning: function declaration isn't a prototype [-Wstrict-prototypes]
 char CHECK_FUNCTION_EXISTS();
 ^
Linking C executable cmTC_afe73
/usr/bin/cmake -E cmake_link_script CMakeFiles/cmTC_afe73.dir/link.txt --verbose=1
/usr/bin/cc   -pthread -maes -march=x86-64 -fno-strict-aliasing -std=c11 -D_GNU_SOURCE   -Wall -Wextra -Wpointer-arith -Wundef -Wvla -Wwrite-strings -Wno-error=extra -Wno-error=deprecated-declarations -Wno-unused-parameter -Wno-unused-variable -Wno-error=unused-variable -Wno-error=undef -Wno-error=uninitialized -Wlogical-op -Wno-error=maybe-uninitialized -Wno-error=cpp -Waggregate-return -Wnested-externs -Wold-style-definition -Wstrict-prototypes  -fPIC  -Wformat -Wformat-security -fstack-protector -fstack-protector-strong -fno-strict-aliasing -DCHECK_FUNCTION_EXISTS=rl_copy_text    CMakeFiles/cmTC_afe73.dir/CheckFunctionExists.c.o  -o cmTC_afe73 -rdynamic /usr/lib/x86_64-linux-gnu/libreadline.a 
/usr/lib/x86_64-linux-gnu/libreadline.a(terminal.o): In function `_rl_get_screen_size':
(.text+0x283): undefined reference to `tgetnum'
/usr/lib/x86_64-linux-gnu/libreadline.a(terminal.o): In function `_rl_get_screen_size':
(.text+0x303): undefined reference to `tgetnum'
/usr/lib/x86_64-linux-gnu/libreadline.a(terminal.o): In function `_rl_init_terminal_io':
(.text+0x6fa): undefined reference to `PC'
/usr/lib/x86_64-linux-gnu/libreadline.a(terminal.o): In function `_rl_init_terminal_io':
(.text+0x70e): undefined reference to `BC'
/usr/lib/x86_64-linux-gnu/libreadline.a(terminal.o): In function `_rl_init_terminal_io':
(.text+0x718): undefined reference to `UP'
/usr/lib/x86_64-linux-gnu/libreadline.a(terminal.o): In function `_rl_init_terminal_io':
(.text+0x7a8): undefined reference to `tgetent'
/usr/lib/x86_64-linux-gnu/libreadline.a(terminal.o): In function `_rl_init_terminal_io':
(.text+0x7e7): undefined reference to `tgetstr'
/usr/lib/x86_64-linux-gnu/libreadline.a(terminal.o): In function `_rl_init_terminal_io':
(.text+0x817): undefined reference to `PC'
/usr/lib/x86_64-linux-gnu/libreadline.a(terminal.o): In function `_rl_init_terminal_io':
(.text+0x82e): undefined reference to `BC'
/usr/lib/x86_64-linux-gnu/libreadline.a(terminal.o): In function `_rl_init_terminal_io':
(.text+0x842): undefined reference to `UP'
/usr/lib/x86_64-linux-gnu/libreadline.a(terminal.o): In function `_rl_init_terminal_io':
(.text+0x857): undefined reference to `tgetflag'
/usr/lib/x86_64-linux-gnu/libreadline.a(terminal.o): In function `_rl_init_terminal_io':
(.text+0x8b1): undefined reference to `tgetflag'
/usr/lib/x86_64-linux-gnu/libreadline.a(terminal.o): In function `_rl_init_terminal_io':
(.text+0x91f): undefined reference to `tgetflag'
/usr/lib/x86_64-linux-gnu/libreadline.a(terminal.o): In function `_rl_init_terminal_io':
(.text+0x9fb): undefined reference to `tgetent'
/usr/lib/x86_64-linux-gnu/libreadline.a(terminal.o): In function `_rl_backspace':
(.text+0xc00): undefined reference to `tputs'
/usr/lib/x86_64-linux-gnu/libreadline.a(terminal.o): In function `rl_ding':
(.text+0xcaa): undefined reference to `tputs'
/usr/lib/x86_64-linux-gnu/libreadline.a(terminal.o): In function `_rl_enable_meta_key':
(.text+0xd17): undefined reference to `tputs'
/usr/lib/x86_64-linux-gnu/libreadline.a(terminal.o): In function `_rl_disable_meta_key':
(.text+0xd69): undefined reference to `tputs'
/usr/lib/x86_64-linux-gnu/libreadline.a(terminal.o): In function `_rl_control_keypad':
(.text+0xd9d): undefined reference to `tputs'
/usr/lib/x86_64-linux-gnu/libreadline.a(terminal.o):(.text+0xdf0): more undefined references to `tputs' follow
/usr/lib/x86_64-linux-gnu/libreadline.a(display.o): In function `update_line':
(.text+0x238e): undefined reference to `tgoto'
/usr/lib/x86_64-linux-gnu/libreadline.a(display.o): In function `update_line':
(.text+0x23a2): undefined reference to `tputs'
/usr/lib/x86_64-linux-gnu/libreadline.a(display.o): In function `update_line':
(.text+0x2520): undefined reference to `tputs'
/usr/lib/x86_64-linux-gnu/libreadline.a(display.o): In function `update_line':
(.text+0x2d49): undefined reference to `tputs'
/usr/lib/x86_64-linux-gnu/libreadline.a(display.o): In function `update_line':
(.text+0x2e7a): undefined reference to `tgoto'
/usr/lib/x86_64-linux-gnu/libreadline.a(display.o): In function `update_line':
(.text+0x2e8c): undefined reference to `tputs'
/usr/lib/x86_64-linux-gnu/libreadline.a(display.o): In function `update_line':
(.text+0x3056): undefined reference to `tputs'
/usr/lib/x86_64-linux-gnu/libreadline.a(display.o): In function `update_line':
(.text+0x309f): undefined reference to `tputs'
/usr/lib/x86_64-linux-gnu/libreadline.a(display.o): In function `update_line':
(.text+0x30d1): undefined reference to `tputs'
/usr/lib/x86_64-linux-gnu/libreadline.a(display.o): In function `rl_redisplay':
(.text+0x4813): undefined reference to `tputs'
/usr/lib/x86_64-linux-gnu/libreadline.a(display.o):(.text+0x4b2a): more undefined references to `tputs' follow
collect2: error: ld returned 1 exit status
CMakeFiles/cmTC_afe73.dir/build.make:98: recipe for target 'cmTC_afe73' failed
make[2]: *** [cmTC_afe73] Error 1
make[2]: Leaving directory '/home/vagrant/slave/monero-static-ubuntu-amd64/build/build/release/CMakeFiles/CMakeTmp'
Makefile:126: recipe for target 'cmTC_afe73/fast' failed
make[1]: *** [cmTC_afe73/fast] Error 2
make[1]: Leaving directory '/home/vagrant/slave/monero-static-ubuntu-amd64/build/build/release/CMakeFiles/CMakeTmp'


Determining if the function rl_filename_completion_function exists failed with the following output:
Change Dir: /home/vagrant/slave/monero-static-ubuntu-amd64/build/build/release/CMakeFiles/CMakeTmp

Run Build Command:"/usr/bin/make" "cmTC_3819f/fast"
make[1]: Entering directory '/home/vagrant/slave/monero-static-ubuntu-amd64/build/build/release/CMakeFiles/CMakeTmp'
/usr/bin/make -f CMakeFiles/cmTC_3819f.dir/build.make CMakeFiles/cmTC_3819f.dir/build
make[2]: Entering directory '/home/vagrant/slave/monero-static-ubuntu-amd64/build/build/release/CMakeFiles/CMakeTmp'
Building C object CMakeFiles/cmTC_3819f.dir/CheckFunctionExists.c.o
/usr/bin/cc    -pthread -maes -march=x86-64 -fno-strict-aliasing -std=c11 -D_GNU_SOURCE   -Wall -Wextra -Wpointer-arith -Wundef -Wvla -Wwrite-strings -Wno-error=extra -Wno-error=deprecated-declarations -Wno-unused-parameter -Wno-unused-variable -Wno-error=unused-variable -Wno-error=undef -Wno-error=uninitialized -Wlogical-op -Wno-error=maybe-uninitialized -Wno-error=cpp -Waggregate-return -Wnested-externs -Wold-style-definition -Wstrict-prototypes  -fPIC  -Wformat -Wformat-security -fstack-protector -fstack-protector-strong -fno-strict-aliasing -DCHECK_FUNCTION_EXISTS=rl_filename_completion_function   -o CMakeFiles/cmTC_3819f.dir/CheckFunctionExists.c.o   -c /usr/share/cmake-3.5/Modules/CheckFunctionExists.c
/usr/share/cmake-3.5/Modules/CheckFunctionExists.c:6:1: warning: function declaration isn't a prototype [-Wstrict-prototypes]
 char CHECK_FUNCTION_EXISTS();
 ^
Linking C executable cmTC_3819f
/usr/bin/cmake -E cmake_link_script CMakeFiles/cmTC_3819f.dir/link.txt --verbose=1
/usr/bin/cc   -pthread -maes -march=x86-64 -fno-strict-aliasing -std=c11 -D_GNU_SOURCE   -Wall -Wextra -Wpointer-arith -Wundef -Wvla -Wwrite-strings -Wno-error=extra -Wno-error=deprecated-declarations -Wno-unused-parameter -Wno-unused-variable -Wno-error=unused-variable -Wno-error=undef -Wno-error=uninitialized -Wlogical-op -Wno-error=maybe-uninitialized -Wno-error=cpp -Waggregate-return -Wnested-externs -Wold-style-definition -Wstrict-prototypes  -fPIC  -Wformat -Wformat-security -fstack-protector -fstack-protector-strong -fno-strict-aliasing -DCHECK_FUNCTION_EXISTS=rl_filename_completion_function    CMakeFiles/cmTC_3819f.dir/CheckFunctionExists.c.o  -o cmTC_3819f -rdynamic /usr/lib/x86_64-linux-gnu/libreadline.a 
/usr/lib/x86_64-linux-gnu/libreadline.a(display.o): In function `_rl_move_cursor_relative':
(.text+0xecc): undefined reference to `tputs'
/usr/lib/x86_64-linux-gnu/libreadline.a(display.o): In function `_rl_move_cursor_relative':
(.text+0xf2e): undefined reference to `tputs'
/usr/lib/x86_64-linux-gnu/libreadline.a(display.o): In function `_rl_move_cursor_relative':
(.text+0x1021): undefined reference to `tputs'
/usr/lib/x86_64-linux-gnu/libreadline.a(display.o): In function `_rl_move_vert':
(.text+0x10cc): undefined reference to `tputs'
/usr/lib/x86_64-linux-gnu/libreadline.a(display.o): In function `_rl_move_vert':
(.text+0x1128): undefined reference to `tputs'
/usr/lib/x86_64-linux-gnu/libreadline.a(display.o): In function `update_line':
(.text+0x238e): undefined reference to `tgoto'
/usr/lib/x86_64-linux-gnu/libreadline.a(display.o): In function `update_line':
(.text+0x23a2): undefined reference to `tputs'
/usr/lib/x86_64-linux-gnu/libreadline.a(display.o): In function `update_line':
(.text+0x2520): undefined reference to `tputs'
/usr/lib/x86_64-linux-gnu/libreadline.a(display.o): In function `update_line':
(.text+0x2d49): undefined reference to `tputs'
/usr/lib/x86_64-linux-gnu/libreadline.a(display.o): In function `update_line':
(.text+0x2e7a): undefined reference to `tgoto'
/usr/lib/x86_64-linux-gnu/libreadline.a(display.o): In function `update_line':
(.text+0x2e8c): undefined reference to `tputs'
/usr/lib/x86_64-linux-gnu/libreadline.a(display.o): In function `update_line':
(.text+0x3056): undefined reference to `tputs'
/usr/lib/x86_64-linux-gnu/libreadline.a(display.o): In function `update_line':
(.text+0x309f): undefined reference to `tputs'
/usr/lib/x86_64-linux-gnu/libreadline.a(display.o): In function `update_line':
(.text+0x30d1): undefined reference to `tputs'
/usr/lib/x86_64-linux-gnu/libreadline.a(display.o): In function `rl_redisplay':
(.text+0x4813): undefined reference to `tputs'
/usr/lib/x86_64-linux-gnu/libreadline.a(display.o):(.text+0x4b2a): more undefined references to `tputs' follow
/usr/lib/x86_64-linux-gnu/libreadline.a(terminal.o): In function `_rl_get_screen_size':
(.text+0x283): undefined reference to `tgetnum'
/usr/lib/x86_64-linux-gnu/libreadline.a(terminal.o): In function `_rl_get_screen_size':
(.text+0x303): undefined reference to `tgetnum'
/usr/lib/x86_64-linux-gnu/libreadline.a(terminal.o): In function `_rl_init_terminal_io':
(.text+0x6fa): undefined reference to `PC'
/usr/lib/x86_64-linux-gnu/libreadline.a(terminal.o): In function `_rl_init_terminal_io':
(.text+0x70e): undefined reference to `BC'
/usr/lib/x86_64-linux-gnu/libreadline.a(terminal.o): In function `_rl_init_terminal_io':
(.text+0x718): undefined reference to `UP'
/usr/lib/x86_64-linux-gnu/libreadline.a(terminal.o): In function `_rl_init_terminal_io':
(.text+0x7a8): undefined reference to `tgetent'
/usr/lib/x86_64-linux-gnu/libreadline.a(terminal.o): In function `_rl_init_terminal_io':
(.text+0x7e7): undefined reference to `tgetstr'
/usr/lib/x86_64-linux-gnu/libreadline.a(terminal.o): In function `_rl_init_terminal_io':
(.text+0x817): undefined reference to `PC'
/usr/lib/x86_64-linux-gnu/libreadline.a(terminal.o): In function `_rl_init_terminal_io':
(.text+0x82e): undefined reference to `BC'
/usr/lib/x86_64-linux-gnu/libreadline.a(terminal.o): In function `_rl_init_terminal_io':
(.text+0x842): undefined reference to `UP'
/usr/lib/x86_64-linux-gnu/libreadline.a(terminal.o): In function `_rl_init_terminal_io':
(.text+0x857): undefined reference to `tgetflag'
/usr/lib/x86_64-linux-gnu/libreadline.a(terminal.o): In function `_rl_init_terminal_io':
(.text+0x8b1): undefined reference to `tgetflag'
/usr/lib/x86_64-linux-gnu/libreadline.a(terminal.o): In function `_rl_init_terminal_io':
(.text+0x91f): undefined reference to `tgetflag'
/usr/lib/x86_64-linux-gnu/libreadline.a(terminal.o): In function `_rl_init_terminal_io':
(.text+0x9fb): undefined reference to `tgetent'
/usr/lib/x86_64-linux-gnu/libreadline.a(terminal.o): In function `_rl_backspace':
(.text+0xc00): undefined reference to `tputs'
/usr/lib/x86_64-linux-gnu/libreadline.a(terminal.o): In function `rl_ding':
(.text+0xcaa): undefined reference to `tputs'
/usr/lib/x86_64-linux-gnu/libreadline.a(terminal.o): In function `_rl_enable_meta_key':
(.text+0xd17): undefined reference to `tputs'
/usr/lib/x86_64-linux-gnu/libreadline.a(terminal.o): In function `_rl_disable_meta_key':
(.text+0xd69): undefined reference to `tputs'
/usr/lib/x86_64-linux-gnu/libreadline.a(terminal.o): In function `_rl_control_keypad':
(.text+0xd9d): undefined reference to `tputs'
/usr/lib/x86_64-linux-gnu/libreadline.a(terminal.o):(.text+0xdf0): more undefined references to `tputs' follow
collect2: error: ld returned 1 exit status
CMakeFiles/cmTC_3819f.dir/build.make:98: recipe for target 'cmTC_3819f' failed
make[2]: *** [cmTC_3819f] Error 1
make[2]: Leaving directory '/home/vagrant/slave/monero-static-ubuntu-amd64/build/build/release/CMakeFiles/CMakeTmp'
Makefile:126: recipe for target 'cmTC_3819f/fast' failed
make[1]: *** [cmTC_3819f/fast] Error 2
make[1]: Leaving directory '/home/vagrant/slave/monero-static-ubuntu-amd64/build/build/release/CMakeFiles/CMakeTmp'