(view as text)
Determining if the pthread_create exist failed with the following output:
Change Dir: /home/vagrant/slave/monero-static-ubuntu-amd64/build/build/release/CMakeFiles/CMakeTmp

Run Build Command:"/usr/bin/make" "cmTC_98e88/fast"
make[1]: Entering directory '/home/vagrant/slave/monero-static-ubuntu-amd64/build/build/release/CMakeFiles/CMakeTmp'
/usr/bin/make -f CMakeFiles/cmTC_98e88.dir/build.make CMakeFiles/cmTC_98e88.dir/build
make[2]: Entering directory '/home/vagrant/slave/monero-static-ubuntu-amd64/build/build/release/CMakeFiles/CMakeTmp'
Building C object CMakeFiles/cmTC_98e88.dir/CheckSymbolExists.c.o
/usr/bin/cc     -o CMakeFiles/cmTC_98e88.dir/CheckSymbolExists.c.o   -c /home/vagrant/slave/monero-static-ubuntu-amd64/build/build/release/CMakeFiles/CMakeTmp/CheckSymbolExists.c
Linking C executable cmTC_98e88
/usr/bin/cmake -E cmake_link_script CMakeFiles/cmTC_98e88.dir/link.txt --verbose=1
/usr/bin/cc       CMakeFiles/cmTC_98e88.dir/CheckSymbolExists.c.o  -o cmTC_98e88 -rdynamic 
CMakeFiles/cmTC_98e88.dir/CheckSymbolExists.c.o: In function `main':
CheckSymbolExists.c:(.text+0x16): undefined reference to `pthread_create'
collect2: error: ld returned 1 exit status
CMakeFiles/cmTC_98e88.dir/build.make:97: recipe for target 'cmTC_98e88' failed
make[2]: *** [cmTC_98e88] Error 1
make[2]: Leaving directory '/home/vagrant/slave/monero-static-ubuntu-amd64/build/build/release/CMakeFiles/CMakeTmp'
Makefile:126: recipe for target 'cmTC_98e88/fast' failed
make[1]: *** [cmTC_98e88/fast] Error 2
make[1]: Leaving directory '/home/vagrant/slave/monero-static-ubuntu-amd64/build/build/release/CMakeFiles/CMakeTmp'

File /home/vagrant/slave/monero-static-ubuntu-amd64/build/build/release/CMakeFiles/CMakeTmp/CheckSymbolExists.c:
/* */
#include <pthread.h>

int main(int argc, char** argv)
{
  (void)argv;
#ifndef pthread_create
  return ((int*)(&pthread_create))[argc];
#else
  (void)argc;
  return 0;
#endif
}

Determining if the function memset_s exists in the c failed with the following output:
Change Dir: /home/vagrant/slave/monero-static-ubuntu-amd64/build/build/release/CMakeFiles/CMakeTmp

Run Build Command:"/usr/bin/make" "cmTC_5ca37/fast"
make[1]: Entering directory '/home/vagrant/slave/monero-static-ubuntu-amd64/build/build/release/CMakeFiles/CMakeTmp'
/usr/bin/make -f CMakeFiles/cmTC_5ca37.dir/build.make CMakeFiles/cmTC_5ca37.dir/build
make[2]: Entering directory '/home/vagrant/slave/monero-static-ubuntu-amd64/build/build/release/CMakeFiles/CMakeTmp'
Building C object CMakeFiles/cmTC_5ca37.dir/CheckFunctionExists.c.o
/usr/bin/cc    -pthread -DCHECK_FUNCTION_EXISTS=memset_s   -o CMakeFiles/cmTC_5ca37.dir/CheckFunctionExists.c.o   -c /usr/share/cmake-3.5/Modules/CheckFunctionExists.c
Linking C executable cmTC_5ca37
/usr/bin/cmake -E cmake_link_script CMakeFiles/cmTC_5ca37.dir/link.txt --verbose=1
/usr/bin/cc   -pthread -DCHECK_FUNCTION_EXISTS=memset_s    CMakeFiles/cmTC_5ca37.dir/CheckFunctionExists.c.o  -o cmTC_5ca37  -L/home/vagrant/slave/monero-static-ubuntu-amd64/build/build/release/CMakeFiles/CMakeTmp/string.h -rdynamic -lc -Wl,-rpath,/home/vagrant/slave/monero-static-ubuntu-amd64/build/build/release/CMakeFiles/CMakeTmp/string.h 
CMakeFiles/cmTC_5ca37.dir/CheckFunctionExists.c.o: In function `main':
CheckFunctionExists.c:(.text+0x15): undefined reference to `memset_s'
collect2: error: ld returned 1 exit status
CMakeFiles/cmTC_5ca37.dir/build.make:97: recipe for target 'cmTC_5ca37' failed
make[2]: *** [cmTC_5ca37] Error 1
make[2]: Leaving directory '/home/vagrant/slave/monero-static-ubuntu-amd64/build/build/release/CMakeFiles/CMakeTmp'
Makefile:126: recipe for target 'cmTC_5ca37/fast' failed
make[1]: *** [cmTC_5ca37/fast] Error 2
make[1]: Leaving directory '/home/vagrant/slave/monero-static-ubuntu-amd64/build/build/release/CMakeFiles/CMakeTmp'


Determining if the function explicit_bzero exists in the c failed with the following output:
Change Dir: /home/vagrant/slave/monero-static-ubuntu-amd64/build/build/release/CMakeFiles/CMakeTmp

Run Build Command:"/usr/bin/make" "cmTC_70aa7/fast"
make[1]: Entering directory '/home/vagrant/slave/monero-static-ubuntu-amd64/build/build/release/CMakeFiles/CMakeTmp'
/usr/bin/make -f CMakeFiles/cmTC_70aa7.dir/build.make CMakeFiles/cmTC_70aa7.dir/build
make[2]: Entering directory '/home/vagrant/slave/monero-static-ubuntu-amd64/build/build/release/CMakeFiles/CMakeTmp'
Building C object CMakeFiles/cmTC_70aa7.dir/CheckFunctionExists.c.o
/usr/bin/cc    -pthread -DCHECK_FUNCTION_EXISTS=explicit_bzero   -o CMakeFiles/cmTC_70aa7.dir/CheckFunctionExists.c.o   -c /usr/share/cmake-3.5/Modules/CheckFunctionExists.c
Linking C executable cmTC_70aa7
/usr/bin/cmake -E cmake_link_script CMakeFiles/cmTC_70aa7.dir/link.txt --verbose=1
/usr/bin/cc   -pthread -DCHECK_FUNCTION_EXISTS=explicit_bzero    CMakeFiles/cmTC_70aa7.dir/CheckFunctionExists.c.o  -o cmTC_70aa7  -L/home/vagrant/slave/monero-static-ubuntu-amd64/build/build/release/CMakeFiles/CMakeTmp/strings.h -rdynamic -lc -Wl,-rpath,/home/vagrant/slave/monero-static-ubuntu-amd64/build/build/release/CMakeFiles/CMakeTmp/strings.h 
CMakeFiles/cmTC_70aa7.dir/CheckFunctionExists.c.o: In function `main':
CheckFunctionExists.c:(.text+0x15): undefined reference to `explicit_bzero'
collect2: error: ld returned 1 exit status
CMakeFiles/cmTC_70aa7.dir/build.make:97: recipe for target 'cmTC_70aa7' failed
make[2]: *** [cmTC_70aa7] Error 1
make[2]: Leaving directory '/home/vagrant/slave/monero-static-ubuntu-amd64/build/build/release/CMakeFiles/CMakeTmp'
Makefile:126: recipe for target 'cmTC_70aa7/fast' failed
make[1]: *** [cmTC_70aa7/fast] Error 2
make[1]: Leaving directory '/home/vagrant/slave/monero-static-ubuntu-amd64/build/build/release/CMakeFiles/CMakeTmp'


Determining if the include file iphlpapi.h exists failed with the following output:
Change Dir: /home/vagrant/slave/monero-static-ubuntu-amd64/build/build/release/CMakeFiles/CMakeTmp

Run Build Command:"/usr/bin/make" "cmTC_195c5/fast"
make[1]: Entering directory '/home/vagrant/slave/monero-static-ubuntu-amd64/build/build/release/CMakeFiles/CMakeTmp'
/usr/bin/make -f CMakeFiles/cmTC_195c5.dir/build.make CMakeFiles/cmTC_195c5.dir/build
make[2]: Entering directory '/home/vagrant/slave/monero-static-ubuntu-amd64/build/build/release/CMakeFiles/CMakeTmp'
Building C object CMakeFiles/cmTC_195c5.dir/CheckIncludeFile.c.o
/usr/bin/cc    -pthread    -o CMakeFiles/cmTC_195c5.dir/CheckIncludeFile.c.o   -c /home/vagrant/slave/monero-static-ubuntu-amd64/build/build/release/CMakeFiles/CMakeTmp/CheckIncludeFile.c
/home/vagrant/slave/monero-static-ubuntu-amd64/build/build/release/CMakeFiles/CMakeTmp/CheckIncludeFile.c:1:22: fatal error: iphlpapi.h: No such file or directory
compilation terminated.
CMakeFiles/cmTC_195c5.dir/build.make:65: recipe for target 'CMakeFiles/cmTC_195c5.dir/CheckIncludeFile.c.o' failed
make[2]: *** [CMakeFiles/cmTC_195c5.dir/CheckIncludeFile.c.o] Error 1
make[2]: Leaving directory '/home/vagrant/slave/monero-static-ubuntu-amd64/build/build/release/CMakeFiles/CMakeTmp'
Makefile:126: recipe for target 'cmTC_195c5/fast' failed
make[1]: *** [cmTC_195c5/fast] Error 2
make[1]: Leaving directory '/home/vagrant/slave/monero-static-ubuntu-amd64/build/build/release/CMakeFiles/CMakeTmp'


Determining if the include file login_cap.h exists failed with the following output:
Change Dir: /home/vagrant/slave/monero-static-ubuntu-amd64/build/build/release/CMakeFiles/CMakeTmp

Run Build Command:"/usr/bin/make" "cmTC_03a14/fast"
make[1]: Entering directory '/home/vagrant/slave/monero-static-ubuntu-amd64/build/build/release/CMakeFiles/CMakeTmp'
/usr/bin/make -f CMakeFiles/cmTC_03a14.dir/build.make CMakeFiles/cmTC_03a14.dir/build
make[2]: Entering directory '/home/vagrant/slave/monero-static-ubuntu-amd64/build/build/release/CMakeFiles/CMakeTmp'
Building C object CMakeFiles/cmTC_03a14.dir/CheckIncludeFile.c.o
/usr/bin/cc    -pthread    -o CMakeFiles/cmTC_03a14.dir/CheckIncludeFile.c.o   -c /home/vagrant/slave/monero-static-ubuntu-amd64/build/build/release/CMakeFiles/CMakeTmp/CheckIncludeFile.c
/home/vagrant/slave/monero-static-ubuntu-amd64/build/build/release/CMakeFiles/CMakeTmp/CheckIncludeFile.c:1:23: fatal error: login_cap.h: No such file or directory
compilation terminated.
CMakeFiles/cmTC_03a14.dir/build.make:65: recipe for target 'CMakeFiles/cmTC_03a14.dir/CheckIncludeFile.c.o' failed
make[2]: *** [CMakeFiles/cmTC_03a14.dir/CheckIncludeFile.c.o] Error 1
make[2]: Leaving directory '/home/vagrant/slave/monero-static-ubuntu-amd64/build/build/release/CMakeFiles/CMakeTmp'
Makefile:126: recipe for target 'cmTC_03a14/fast' failed
make[1]: *** [cmTC_03a14/fast] Error 2
make[1]: Leaving directory '/home/vagrant/slave/monero-static-ubuntu-amd64/build/build/release/CMakeFiles/CMakeTmp'


Determining if the include file sys/sha2.h exists failed with the following output:
Change Dir: /home/vagrant/slave/monero-static-ubuntu-amd64/build/build/release/CMakeFiles/CMakeTmp

Run Build Command:"/usr/bin/make" "cmTC_8b440/fast"
make[1]: Entering directory '/home/vagrant/slave/monero-static-ubuntu-amd64/build/build/release/CMakeFiles/CMakeTmp'
/usr/bin/make -f CMakeFiles/cmTC_8b440.dir/build.make CMakeFiles/cmTC_8b440.dir/build
make[2]: Entering directory '/home/vagrant/slave/monero-static-ubuntu-amd64/build/build/release/CMakeFiles/CMakeTmp'
Building C object CMakeFiles/cmTC_8b440.dir/CheckIncludeFile.c.o
/usr/bin/cc    -pthread    -o CMakeFiles/cmTC_8b440.dir/CheckIncludeFile.c.o   -c /home/vagrant/slave/monero-static-ubuntu-amd64/build/build/release/CMakeFiles/CMakeTmp/CheckIncludeFile.c
/home/vagrant/slave/monero-static-ubuntu-amd64/build/build/release/CMakeFiles/CMakeTmp/CheckIncludeFile.c:1:22: fatal error: sys/sha2.h: No such file or directory
compilation terminated.
CMakeFiles/cmTC_8b440.dir/build.make:65: recipe for target 'CMakeFiles/cmTC_8b440.dir/CheckIncludeFile.c.o' failed
make[2]: *** [CMakeFiles/cmTC_8b440.dir/CheckIncludeFile.c.o] Error 1
make[2]: Leaving directory '/home/vagrant/slave/monero-static-ubuntu-amd64/build/build/release/CMakeFiles/CMakeTmp'
Makefile:126: recipe for target 'cmTC_8b440/fast' failed
make[1]: *** [cmTC_8b440/fast] Error 2
make[1]: Leaving directory '/home/vagrant/slave/monero-static-ubuntu-amd64/build/build/release/CMakeFiles/CMakeTmp'


Determining if the include file vfork.h exists failed with the following output:
Change Dir: /home/vagrant/slave/monero-static-ubuntu-amd64/build/build/release/CMakeFiles/CMakeTmp

Run Build Command:"/usr/bin/make" "cmTC_f2eb7/fast"
make[1]: Entering directory '/home/vagrant/slave/monero-static-ubuntu-amd64/build/build/release/CMakeFiles/CMakeTmp'
/usr/bin/make -f CMakeFiles/cmTC_f2eb7.dir/build.make CMakeFiles/cmTC_f2eb7.dir/build
make[2]: Entering directory '/home/vagrant/slave/monero-static-ubuntu-amd64/build/build/release/CMakeFiles/CMakeTmp'
Building C object CMakeFiles/cmTC_f2eb7.dir/CheckIncludeFile.c.o
/usr/bin/cc    -pthread    -o CMakeFiles/cmTC_f2eb7.dir/CheckIncludeFile.c.o   -c /home/vagrant/slave/monero-static-ubuntu-amd64/build/build/release/CMakeFiles/CMakeTmp/CheckIncludeFile.c
/home/vagrant/slave/monero-static-ubuntu-amd64/build/build/release/CMakeFiles/CMakeTmp/CheckIncludeFile.c:1:19: fatal error: vfork.h: No such file or directory
compilation terminated.
CMakeFiles/cmTC_f2eb7.dir/build.make:65: recipe for target 'CMakeFiles/cmTC_f2eb7.dir/CheckIncludeFile.c.o' failed
make[2]: *** [CMakeFiles/cmTC_f2eb7.dir/CheckIncludeFile.c.o] Error 1
make[2]: Leaving directory '/home/vagrant/slave/monero-static-ubuntu-amd64/build/build/release/CMakeFiles/CMakeTmp'
Makefile:126: recipe for target 'cmTC_f2eb7/fast' failed
make[1]: *** [cmTC_f2eb7/fast] Error 2
make[1]: Leaving directory '/home/vagrant/slave/monero-static-ubuntu-amd64/build/build/release/CMakeFiles/CMakeTmp'


Determining if the include file windows.h exists failed with the following output:
Change Dir: /home/vagrant/slave/monero-static-ubuntu-amd64/build/build/release/CMakeFiles/CMakeTmp

Run Build Command:"/usr/bin/make" "cmTC_a162b/fast"
make[1]: Entering directory '/home/vagrant/slave/monero-static-ubuntu-amd64/build/build/release/CMakeFiles/CMakeTmp'
/usr/bin/make -f CMakeFiles/cmTC_a162b.dir/build.make CMakeFiles/cmTC_a162b.dir/build
make[2]: Entering directory '/home/vagrant/slave/monero-static-ubuntu-amd64/build/build/release/CMakeFiles/CMakeTmp'
Building C object CMakeFiles/cmTC_a162b.dir/CheckIncludeFile.c.o
/usr/bin/cc    -pthread    -o CMakeFiles/cmTC_a162b.dir/CheckIncludeFile.c.o   -c /home/vagrant/slave/monero-static-ubuntu-amd64/build/build/release/CMakeFiles/CMakeTmp/CheckIncludeFile.c
/home/vagrant/slave/monero-static-ubuntu-amd64/build/build/release/CMakeFiles/CMakeTmp/CheckIncludeFile.c:1:21: fatal error: windows.h: No such file or directory
compilation terminated.
CMakeFiles/cmTC_a162b.dir/build.make:65: recipe for target 'CMakeFiles/cmTC_a162b.dir/CheckIncludeFile.c.o' failed
make[2]: *** [CMakeFiles/cmTC_a162b.dir/CheckIncludeFile.c.o] Error 1
make[2]: Leaving directory '/home/vagrant/slave/monero-static-ubuntu-amd64/build/build/release/CMakeFiles/CMakeTmp'
Makefile:126: recipe for target 'cmTC_a162b/fast' failed
make[1]: *** [cmTC_a162b/fast] Error 2
make[1]: Leaving directory '/home/vagrant/slave/monero-static-ubuntu-amd64/build/build/release/CMakeFiles/CMakeTmp'


Determining if the include file winsock2.h exists failed with the following output:
Change Dir: /home/vagrant/slave/monero-static-ubuntu-amd64/build/build/release/CMakeFiles/CMakeTmp

Run Build Command:"/usr/bin/make" "cmTC_66008/fast"
make[1]: Entering directory '/home/vagrant/slave/monero-static-ubuntu-amd64/build/build/release/CMakeFiles/CMakeTmp'
/usr/bin/make -f CMakeFiles/cmTC_66008.dir/build.make CMakeFiles/cmTC_66008.dir/build
make[2]: Entering directory '/home/vagrant/slave/monero-static-ubuntu-amd64/build/build/release/CMakeFiles/CMakeTmp'
Building C object CMakeFiles/cmTC_66008.dir/CheckIncludeFile.c.o
/usr/bin/cc    -pthread    -o CMakeFiles/cmTC_66008.dir/CheckIncludeFile.c.o   -c /home/vagrant/slave/monero-static-ubuntu-amd64/build/build/release/CMakeFiles/CMakeTmp/CheckIncludeFile.c
/home/vagrant/slave/monero-static-ubuntu-amd64/build/build/release/CMakeFiles/CMakeTmp/CheckIncludeFile.c:1:22: fatal error: winsock2.h: No such file or directory
compilation terminated.
CMakeFiles/cmTC_66008.dir/build.make:65: recipe for target 'CMakeFiles/cmTC_66008.dir/CheckIncludeFile.c.o' failed
make[2]: *** [CMakeFiles/cmTC_66008.dir/CheckIncludeFile.c.o] Error 1
make[2]: Leaving directory '/home/vagrant/slave/monero-static-ubuntu-amd64/build/build/release/CMakeFiles/CMakeTmp'
Makefile:126: recipe for target 'cmTC_66008/fast' failed
make[1]: *** [cmTC_66008/fast] Error 2
make[1]: Leaving directory '/home/vagrant/slave/monero-static-ubuntu-amd64/build/build/release/CMakeFiles/CMakeTmp'


Determining if the include file ws2tcpip.h exists failed with the following output:
Change Dir: /home/vagrant/slave/monero-static-ubuntu-amd64/build/build/release/CMakeFiles/CMakeTmp

Run Build Command:"/usr/bin/make" "cmTC_6122f/fast"
make[1]: Entering directory '/home/vagrant/slave/monero-static-ubuntu-amd64/build/build/release/CMakeFiles/CMakeTmp'
/usr/bin/make -f CMakeFiles/cmTC_6122f.dir/build.make CMakeFiles/cmTC_6122f.dir/build
make[2]: Entering directory '/home/vagrant/slave/monero-static-ubuntu-amd64/build/build/release/CMakeFiles/CMakeTmp'
Building C object CMakeFiles/cmTC_6122f.dir/CheckIncludeFile.c.o
/usr/bin/cc    -pthread    -o CMakeFiles/cmTC_6122f.dir/CheckIncludeFile.c.o   -c /home/vagrant/slave/monero-static-ubuntu-amd64/build/build/release/CMakeFiles/CMakeTmp/CheckIncludeFile.c
/home/vagrant/slave/monero-static-ubuntu-amd64/build/build/release/CMakeFiles/CMakeTmp/CheckIncludeFile.c:1:22: fatal error: ws2tcpip.h: No such file or directory
compilation terminated.
CMakeFiles/cmTC_6122f.dir/build.make:65: recipe for target 'CMakeFiles/cmTC_6122f.dir/CheckIncludeFile.c.o' failed
make[2]: *** [CMakeFiles/cmTC_6122f.dir/CheckIncludeFile.c.o] Error 1
make[2]: Leaving directory '/home/vagrant/slave/monero-static-ubuntu-amd64/build/build/release/CMakeFiles/CMakeTmp'
Makefile:126: recipe for target 'cmTC_6122f/fast' failed
make[1]: *** [cmTC_6122f/fast] Error 2
make[1]: Leaving directory '/home/vagrant/slave/monero-static-ubuntu-amd64/build/build/release/CMakeFiles/CMakeTmp'


Determining if the function _beginthreadex exists failed with the following output:
Change Dir: /home/vagrant/slave/monero-static-ubuntu-amd64/build/build/release/CMakeFiles/CMakeTmp

Run Build Command:"/usr/bin/make" "cmTC_93efe/fast"
make[1]: Entering directory '/home/vagrant/slave/monero-static-ubuntu-amd64/build/build/release/CMakeFiles/CMakeTmp'
/usr/bin/make -f CMakeFiles/cmTC_93efe.dir/build.make CMakeFiles/cmTC_93efe.dir/build
make[2]: Entering directory '/home/vagrant/slave/monero-static-ubuntu-amd64/build/build/release/CMakeFiles/CMakeTmp'
Building C object CMakeFiles/cmTC_93efe.dir/CheckFunctionExists.c.o
/usr/bin/cc    -pthread -DCHECK_FUNCTION_EXISTS=_beginthreadex   -o CMakeFiles/cmTC_93efe.dir/CheckFunctionExists.c.o   -c /usr/share/cmake-3.5/Modules/CheckFunctionExists.c
Linking C executable cmTC_93efe
/usr/bin/cmake -E cmake_link_script CMakeFiles/cmTC_93efe.dir/link.txt --verbose=1
/usr/bin/cc   -pthread -DCHECK_FUNCTION_EXISTS=_beginthreadex    CMakeFiles/cmTC_93efe.dir/CheckFunctionExists.c.o  -o cmTC_93efe -rdynamic 
CMakeFiles/cmTC_93efe.dir/CheckFunctionExists.c.o: In function `main':
CheckFunctionExists.c:(.text+0x15): undefined reference to `_beginthreadex'
collect2: error: ld returned 1 exit status
CMakeFiles/cmTC_93efe.dir/build.make:97: recipe for target 'cmTC_93efe' failed
make[2]: *** [cmTC_93efe] Error 1
make[2]: Leaving directory '/home/vagrant/slave/monero-static-ubuntu-amd64/build/build/release/CMakeFiles/CMakeTmp'
Makefile:126: recipe for target 'cmTC_93efe/fast' failed
make[1]: *** [cmTC_93efe/fast] Error 2
make[1]: Leaving directory '/home/vagrant/slave/monero-static-ubuntu-amd64/build/build/release/CMakeFiles/CMakeTmp'


Determining if the function arc4random exists failed with the following output:
Change Dir: /home/vagrant/slave/monero-static-ubuntu-amd64/build/build/release/CMakeFiles/CMakeTmp

Run Build Command:"/usr/bin/make" "cmTC_77bce/fast"
make[1]: Entering directory '/home/vagrant/slave/monero-static-ubuntu-amd64/build/build/release/CMakeFiles/CMakeTmp'
/usr/bin/make -f CMakeFiles/cmTC_77bce.dir/build.make CMakeFiles/cmTC_77bce.dir/build
make[2]: Entering directory '/home/vagrant/slave/monero-static-ubuntu-amd64/build/build/release/CMakeFiles/CMakeTmp'
Building C object CMakeFiles/cmTC_77bce.dir/CheckFunctionExists.c.o
/usr/bin/cc    -pthread -DCHECK_FUNCTION_EXISTS=arc4random   -o CMakeFiles/cmTC_77bce.dir/CheckFunctionExists.c.o   -c /usr/share/cmake-3.5/Modules/CheckFunctionExists.c
Linking C executable cmTC_77bce
/usr/bin/cmake -E cmake_link_script CMakeFiles/cmTC_77bce.dir/link.txt --verbose=1
/usr/bin/cc   -pthread -DCHECK_FUNCTION_EXISTS=arc4random    CMakeFiles/cmTC_77bce.dir/CheckFunctionExists.c.o  -o cmTC_77bce -rdynamic 
CMakeFiles/cmTC_77bce.dir/CheckFunctionExists.c.o: In function `main':
CheckFunctionExists.c:(.text+0x15): undefined reference to `arc4random'
collect2: error: ld returned 1 exit status
CMakeFiles/cmTC_77bce.dir/build.make:97: recipe for target 'cmTC_77bce' failed
make[2]: *** [cmTC_77bce] Error 1
make[2]: Leaving directory '/home/vagrant/slave/monero-static-ubuntu-amd64/build/build/release/CMakeFiles/CMakeTmp'
Makefile:126: recipe for target 'cmTC_77bce/fast' failed
make[1]: *** [cmTC_77bce/fast] Error 2
make[1]: Leaving directory '/home/vagrant/slave/monero-static-ubuntu-amd64/build/build/release/CMakeFiles/CMakeTmp'


Determining if the function arc4random_uniform exists failed with the following output:
Change Dir: /home/vagrant/slave/monero-static-ubuntu-amd64/build/build/release/CMakeFiles/CMakeTmp

Run Build Command:"/usr/bin/make" "cmTC_4f9b5/fast"
make[1]: Entering directory '/home/vagrant/slave/monero-static-ubuntu-amd64/build/build/release/CMakeFiles/CMakeTmp'
/usr/bin/make -f CMakeFiles/cmTC_4f9b5.dir/build.make CMakeFiles/cmTC_4f9b5.dir/build
make[2]: Entering directory '/home/vagrant/slave/monero-static-ubuntu-amd64/build/build/release/CMakeFiles/CMakeTmp'
Building C object CMakeFiles/cmTC_4f9b5.dir/CheckFunctionExists.c.o
/usr/bin/cc    -pthread -DCHECK_FUNCTION_EXISTS=arc4random_uniform   -o CMakeFiles/cmTC_4f9b5.dir/CheckFunctionExists.c.o   -c /usr/share/cmake-3.5/Modules/CheckFunctionExists.c
Linking C executable cmTC_4f9b5
/usr/bin/cmake -E cmake_link_script CMakeFiles/cmTC_4f9b5.dir/link.txt --verbose=1
/usr/bin/cc   -pthread -DCHECK_FUNCTION_EXISTS=arc4random_uniform    CMakeFiles/cmTC_4f9b5.dir/CheckFunctionExists.c.o  -o cmTC_4f9b5 -rdynamic 
CMakeFiles/cmTC_4f9b5.dir/CheckFunctionExists.c.o: In function `main':
CheckFunctionExists.c:(.text+0x15): undefined reference to `arc4random_uniform'
collect2: error: ld returned 1 exit status
CMakeFiles/cmTC_4f9b5.dir/build.make:97: recipe for target 'cmTC_4f9b5' failed
make[2]: *** [cmTC_4f9b5] Error 1
make[2]: Leaving directory '/home/vagrant/slave/monero-static-ubuntu-amd64/build/build/release/CMakeFiles/CMakeTmp'
Makefile:126: recipe for target 'cmTC_4f9b5/fast' failed
make[1]: *** [cmTC_4f9b5/fast] Error 2
make[1]: Leaving directory '/home/vagrant/slave/monero-static-ubuntu-amd64/build/build/release/CMakeFiles/CMakeTmp'


Determining if the function getentropy exists failed with the following output:
Change Dir: /home/vagrant/slave/monero-static-ubuntu-amd64/build/build/release/CMakeFiles/CMakeTmp

Run Build Command:"/usr/bin/make" "cmTC_bcb33/fast"
make[1]: Entering directory '/home/vagrant/slave/monero-static-ubuntu-amd64/build/build/release/CMakeFiles/CMakeTmp'
/usr/bin/make -f CMakeFiles/cmTC_bcb33.dir/build.make CMakeFiles/cmTC_bcb33.dir/build
make[2]: Entering directory '/home/vagrant/slave/monero-static-ubuntu-amd64/build/build/release/CMakeFiles/CMakeTmp'
Building C object CMakeFiles/cmTC_bcb33.dir/CheckFunctionExists.c.o
/usr/bin/cc    -pthread -DCHECK_FUNCTION_EXISTS=getentropy   -o CMakeFiles/cmTC_bcb33.dir/CheckFunctionExists.c.o   -c /usr/share/cmake-3.5/Modules/CheckFunctionExists.c
Linking C executable cmTC_bcb33
/usr/bin/cmake -E cmake_link_script CMakeFiles/cmTC_bcb33.dir/link.txt --verbose=1
/usr/bin/cc   -pthread -DCHECK_FUNCTION_EXISTS=getentropy    CMakeFiles/cmTC_bcb33.dir/CheckFunctionExists.c.o  -o cmTC_bcb33 -rdynamic 
CMakeFiles/cmTC_bcb33.dir/CheckFunctionExists.c.o: In function `main':
CheckFunctionExists.c:(.text+0x15): undefined reference to `getentropy'
collect2: error: ld returned 1 exit status
CMakeFiles/cmTC_bcb33.dir/build.make:97: recipe for target 'cmTC_bcb33' failed
make[2]: *** [cmTC_bcb33] Error 1
make[2]: Leaving directory '/home/vagrant/slave/monero-static-ubuntu-amd64/build/build/release/CMakeFiles/CMakeTmp'
Makefile:126: recipe for target 'cmTC_bcb33/fast' failed
make[1]: *** [cmTC_bcb33/fast] Error 2
make[1]: Leaving directory '/home/vagrant/slave/monero-static-ubuntu-amd64/build/build/release/CMakeFiles/CMakeTmp'


Determining if the function ioctlsocket exists failed with the following output:
Change Dir: /home/vagrant/slave/monero-static-ubuntu-amd64/build/build/release/CMakeFiles/CMakeTmp

Run Build Command:"/usr/bin/make" "cmTC_5321f/fast"
make[1]: Entering directory '/home/vagrant/slave/monero-static-ubuntu-amd64/build/build/release/CMakeFiles/CMakeTmp'
/usr/bin/make -f CMakeFiles/cmTC_5321f.dir/build.make CMakeFiles/cmTC_5321f.dir/build
make[2]: Entering directory '/home/vagrant/slave/monero-static-ubuntu-amd64/build/build/release/CMakeFiles/CMakeTmp'
Building C object CMakeFiles/cmTC_5321f.dir/CheckFunctionExists.c.o
/usr/bin/cc    -pthread -DCHECK_FUNCTION_EXISTS=ioctlsocket   -o CMakeFiles/cmTC_5321f.dir/CheckFunctionExists.c.o   -c /usr/share/cmake-3.5/Modules/CheckFunctionExists.c
Linking C executable cmTC_5321f
/usr/bin/cmake -E cmake_link_script CMakeFiles/cmTC_5321f.dir/link.txt --verbose=1
/usr/bin/cc   -pthread -DCHECK_FUNCTION_EXISTS=ioctlsocket    CMakeFiles/cmTC_5321f.dir/CheckFunctionExists.c.o  -o cmTC_5321f -rdynamic 
CMakeFiles/cmTC_5321f.dir/CheckFunctionExists.c.o: In function `main':
CheckFunctionExists.c:(.text+0x15): undefined reference to `ioctlsocket'
collect2: error: ld returned 1 exit status
CMakeFiles/cmTC_5321f.dir/build.make:97: recipe for target 'cmTC_5321f' failed
make[2]: *** [cmTC_5321f] Error 1
make[2]: Leaving directory '/home/vagrant/slave/monero-static-ubuntu-amd64/build/build/release/CMakeFiles/CMakeTmp'
Makefile:126: recipe for target 'cmTC_5321f/fast' failed
make[1]: *** [cmTC_5321f/fast] Error 2
make[1]: Leaving directory '/home/vagrant/slave/monero-static-ubuntu-amd64/build/build/release/CMakeFiles/CMakeTmp'


Determining if the function reallocarray exists failed with the following output:
Change Dir: /home/vagrant/slave/monero-static-ubuntu-amd64/build/build/release/CMakeFiles/CMakeTmp

Run Build Command:"/usr/bin/make" "cmTC_3c593/fast"
make[1]: Entering directory '/home/vagrant/slave/monero-static-ubuntu-amd64/build/build/release/CMakeFiles/CMakeTmp'
/usr/bin/make -f CMakeFiles/cmTC_3c593.dir/build.make CMakeFiles/cmTC_3c593.dir/build
make[2]: Entering directory '/home/vagrant/slave/monero-static-ubuntu-amd64/build/build/release/CMakeFiles/CMakeTmp'
Building C object CMakeFiles/cmTC_3c593.dir/CheckFunctionExists.c.o
/usr/bin/cc    -pthread -DCHECK_FUNCTION_EXISTS=reallocarray   -o CMakeFiles/cmTC_3c593.dir/CheckFunctionExists.c.o   -c /usr/share/cmake-3.5/Modules/CheckFunctionExists.c
Linking C executable cmTC_3c593
/usr/bin/cmake -E cmake_link_script CMakeFiles/cmTC_3c593.dir/link.txt --verbose=1
/usr/bin/cc   -pthread -DCHECK_FUNCTION_EXISTS=reallocarray    CMakeFiles/cmTC_3c593.dir/CheckFunctionExists.c.o  -o cmTC_3c593 -rdynamic 
CMakeFiles/cmTC_3c593.dir/CheckFunctionExists.c.o: In function `main':
CheckFunctionExists.c:(.text+0x15): undefined reference to `reallocarray'
collect2: error: ld returned 1 exit status
CMakeFiles/cmTC_3c593.dir/build.make:97: recipe for target 'cmTC_3c593' failed
make[2]: *** [cmTC_3c593] Error 1
make[2]: Leaving directory '/home/vagrant/slave/monero-static-ubuntu-amd64/build/build/release/CMakeFiles/CMakeTmp'
Makefile:126: recipe for target 'cmTC_3c593/fast' failed
make[1]: *** [cmTC_3c593/fast] Error 2
make[1]: Leaving directory '/home/vagrant/slave/monero-static-ubuntu-amd64/build/build/release/CMakeFiles/CMakeTmp'


Determining if the function setusercontent exists failed with the following output:
Change Dir: /home/vagrant/slave/monero-static-ubuntu-amd64/build/build/release/CMakeFiles/CMakeTmp

Run Build Command:"/usr/bin/make" "cmTC_a4b59/fast"
make[1]: Entering directory '/home/vagrant/slave/monero-static-ubuntu-amd64/build/build/release/CMakeFiles/CMakeTmp'
/usr/bin/make -f CMakeFiles/cmTC_a4b59.dir/build.make CMakeFiles/cmTC_a4b59.dir/build
make[2]: Entering directory '/home/vagrant/slave/monero-static-ubuntu-amd64/build/build/release/CMakeFiles/CMakeTmp'
Building C object CMakeFiles/cmTC_a4b59.dir/CheckFunctionExists.c.o
/usr/bin/cc    -pthread -DCHECK_FUNCTION_EXISTS=setusercontent   -o CMakeFiles/cmTC_a4b59.dir/CheckFunctionExists.c.o   -c /usr/share/cmake-3.5/Modules/CheckFunctionExists.c
Linking C executable cmTC_a4b59
/usr/bin/cmake -E cmake_link_script CMakeFiles/cmTC_a4b59.dir/link.txt --verbose=1
/usr/bin/cc   -pthread -DCHECK_FUNCTION_EXISTS=setusercontent    CMakeFiles/cmTC_a4b59.dir/CheckFunctionExists.c.o  -o cmTC_a4b59 -rdynamic 
CMakeFiles/cmTC_a4b59.dir/CheckFunctionExists.c.o: In function `main':
CheckFunctionExists.c:(.text+0x15): undefined reference to `setusercontent'
collect2: error: ld returned 1 exit status
CMakeFiles/cmTC_a4b59.dir/build.make:97: recipe for target 'cmTC_a4b59' failed
make[2]: *** [cmTC_a4b59] Error 1
make[2]: Leaving directory '/home/vagrant/slave/monero-static-ubuntu-amd64/build/build/release/CMakeFiles/CMakeTmp'
Makefile:126: recipe for target 'cmTC_a4b59/fast' failed
make[1]: *** [cmTC_a4b59/fast] Error 2
make[1]: Leaving directory '/home/vagrant/slave/monero-static-ubuntu-amd64/build/build/release/CMakeFiles/CMakeTmp'


Determining if the function strlcat exists failed with the following output:
Change Dir: /home/vagrant/slave/monero-static-ubuntu-amd64/build/build/release/CMakeFiles/CMakeTmp

Run Build Command:"/usr/bin/make" "cmTC_c4a37/fast"
make[1]: Entering directory '/home/vagrant/slave/monero-static-ubuntu-amd64/build/build/release/CMakeFiles/CMakeTmp'
/usr/bin/make -f CMakeFiles/cmTC_c4a37.dir/build.make CMakeFiles/cmTC_c4a37.dir/build
make[2]: Entering directory '/home/vagrant/slave/monero-static-ubuntu-amd64/build/build/release/CMakeFiles/CMakeTmp'
Building C object CMakeFiles/cmTC_c4a37.dir/CheckFunctionExists.c.o
/usr/bin/cc    -pthread -DCHECK_FUNCTION_EXISTS=strlcat   -o CMakeFiles/cmTC_c4a37.dir/CheckFunctionExists.c.o   -c /usr/share/cmake-3.5/Modules/CheckFunctionExists.c
Linking C executable cmTC_c4a37
/usr/bin/cmake -E cmake_link_script CMakeFiles/cmTC_c4a37.dir/link.txt --verbose=1
/usr/bin/cc   -pthread -DCHECK_FUNCTION_EXISTS=strlcat    CMakeFiles/cmTC_c4a37.dir/CheckFunctionExists.c.o  -o cmTC_c4a37 -rdynamic 
CMakeFiles/cmTC_c4a37.dir/CheckFunctionExists.c.o: In function `main':
CheckFunctionExists.c:(.text+0x15): undefined reference to `strlcat'
collect2: error: ld returned 1 exit status
CMakeFiles/cmTC_c4a37.dir/build.make:97: recipe for target 'cmTC_c4a37' failed
make[2]: *** [cmTC_c4a37] Error 1
make[2]: Leaving directory '/home/vagrant/slave/monero-static-ubuntu-amd64/build/build/release/CMakeFiles/CMakeTmp'
Makefile:126: recipe for target 'cmTC_c4a37/fast' failed
make[1]: *** [cmTC_c4a37/fast] Error 2
make[1]: Leaving directory '/home/vagrant/slave/monero-static-ubuntu-amd64/build/build/release/CMakeFiles/CMakeTmp'


Determining if the function strlcpy exists failed with the following output:
Change Dir: /home/vagrant/slave/monero-static-ubuntu-amd64/build/build/release/CMakeFiles/CMakeTmp

Run Build Command:"/usr/bin/make" "cmTC_d1698/fast"
make[1]: Entering directory '/home/vagrant/slave/monero-static-ubuntu-amd64/build/build/release/CMakeFiles/CMakeTmp'
/usr/bin/make -f CMakeFiles/cmTC_d1698.dir/build.make CMakeFiles/cmTC_d1698.dir/build
make[2]: Entering directory '/home/vagrant/slave/monero-static-ubuntu-amd64/build/build/release/CMakeFiles/CMakeTmp'
Building C object CMakeFiles/cmTC_d1698.dir/CheckFunctionExists.c.o
/usr/bin/cc    -pthread -DCHECK_FUNCTION_EXISTS=strlcpy   -o CMakeFiles/cmTC_d1698.dir/CheckFunctionExists.c.o   -c /usr/share/cmake-3.5/Modules/CheckFunctionExists.c
Linking C executable cmTC_d1698
/usr/bin/cmake -E cmake_link_script CMakeFiles/cmTC_d1698.dir/link.txt --verbose=1
/usr/bin/cc   -pthread -DCHECK_FUNCTION_EXISTS=strlcpy    CMakeFiles/cmTC_d1698.dir/CheckFunctionExists.c.o  -o cmTC_d1698 -rdynamic 
CMakeFiles/cmTC_d1698.dir/CheckFunctionExists.c.o: In function `main':
CheckFunctionExists.c:(.text+0x15): undefined reference to `strlcpy'
collect2: error: ld returned 1 exit status
CMakeFiles/cmTC_d1698.dir/build.make:97: recipe for target 'cmTC_d1698' failed
make[2]: *** [cmTC_d1698] Error 1
make[2]: Leaving directory '/home/vagrant/slave/monero-static-ubuntu-amd64/build/build/release/CMakeFiles/CMakeTmp'
Makefile:126: recipe for target 'cmTC_d1698/fast' failed
make[1]: *** [cmTC_d1698/fast] Error 2
make[1]: Leaving directory '/home/vagrant/slave/monero-static-ubuntu-amd64/build/build/release/CMakeFiles/CMakeTmp'


Determining if the PTHREAD_PRIO_INHERIT exist failed with the following output:
Change Dir: /home/vagrant/slave/monero-static-ubuntu-amd64/build/build/release/CMakeFiles/CMakeTmp

Run Build Command:"/usr/bin/make" "cmTC_d19a9/fast"
make[1]: Entering directory '/home/vagrant/slave/monero-static-ubuntu-amd64/build/build/release/CMakeFiles/CMakeTmp'
/usr/bin/make -f CMakeFiles/cmTC_d19a9.dir/build.make CMakeFiles/cmTC_d19a9.dir/build
make[2]: Entering directory '/home/vagrant/slave/monero-static-ubuntu-amd64/build/build/release/CMakeFiles/CMakeTmp'
Building C object CMakeFiles/cmTC_d19a9.dir/CheckSymbolExists.c.o
/usr/bin/cc    -pthread    -o CMakeFiles/cmTC_d19a9.dir/CheckSymbolExists.c.o   -c /home/vagrant/slave/monero-static-ubuntu-amd64/build/build/release/CMakeFiles/CMakeTmp/CheckSymbolExists.c
/home/vagrant/slave/monero-static-ubuntu-amd64/build/build/release/CMakeFiles/CMakeTmp/CheckSymbolExists.c: In function 'main':
/home/vagrant/slave/monero-static-ubuntu-amd64/build/build/release/CMakeFiles/CMakeTmp/CheckSymbolExists.c:8:18: error: lvalue required as unary '&' operand
   return ((int*)(&PTHREAD_PRIO_INHERIT))[argc];
                  ^
CMakeFiles/cmTC_d19a9.dir/build.make:65: recipe for target 'CMakeFiles/cmTC_d19a9.dir/CheckSymbolExists.c.o' failed
make[2]: *** [CMakeFiles/cmTC_d19a9.dir/CheckSymbolExists.c.o] Error 1
make[2]: Leaving directory '/home/vagrant/slave/monero-static-ubuntu-amd64/build/build/release/CMakeFiles/CMakeTmp'
Makefile:126: recipe for target 'cmTC_d19a9/fast' failed
make[1]: *** [cmTC_d19a9/fast] Error 2
make[1]: Leaving directory '/home/vagrant/slave/monero-static-ubuntu-amd64/build/build/release/CMakeFiles/CMakeTmp'

File /home/vagrant/slave/monero-static-ubuntu-amd64/build/build/release/CMakeFiles/CMakeTmp/CheckSymbolExists.c:
/* */
#include <pthread.h>

int main(int argc, char** argv)
{
  (void)argv;
#ifndef PTHREAD_PRIO_INHERIT
  return ((int*)(&PTHREAD_PRIO_INHERIT))[argc];
#else
  (void)argc;
  return 0;
#endif
}

Determining if the pthread_rwlock_t exist failed with the following output:
Change Dir: /home/vagrant/slave/monero-static-ubuntu-amd64/build/build/release/CMakeFiles/CMakeTmp

Run Build Command:"/usr/bin/make" "cmTC_faeb5/fast"
make[1]: Entering directory '/home/vagrant/slave/monero-static-ubuntu-amd64/build/build/release/CMakeFiles/CMakeTmp'
/usr/bin/make -f CMakeFiles/cmTC_faeb5.dir/build.make CMakeFiles/cmTC_faeb5.dir/build
make[2]: Entering directory '/home/vagrant/slave/monero-static-ubuntu-amd64/build/build/release/CMakeFiles/CMakeTmp'
Building C object CMakeFiles/cmTC_faeb5.dir/CheckSymbolExists.c.o
/usr/bin/cc    -pthread    -o CMakeFiles/cmTC_faeb5.dir/CheckSymbolExists.c.o   -c /home/vagrant/slave/monero-static-ubuntu-amd64/build/build/release/CMakeFiles/CMakeTmp/CheckSymbolExists.c
/home/vagrant/slave/monero-static-ubuntu-amd64/build/build/release/CMakeFiles/CMakeTmp/CheckSymbolExists.c: In function 'main':
/home/vagrant/slave/monero-static-ubuntu-amd64/build/build/release/CMakeFiles/CMakeTmp/CheckSymbolExists.c:8:19: error: expected expression before 'pthread_rwlock_t'
   return ((int*)(&pthread_rwlock_t))[argc];
                   ^
CMakeFiles/cmTC_faeb5.dir/build.make:65: recipe for target 'CMakeFiles/cmTC_faeb5.dir/CheckSymbolExists.c.o' failed
make[2]: *** [CMakeFiles/cmTC_faeb5.dir/CheckSymbolExists.c.o] Error 1
make[2]: Leaving directory '/home/vagrant/slave/monero-static-ubuntu-amd64/build/build/release/CMakeFiles/CMakeTmp'
Makefile:126: recipe for target 'cmTC_faeb5/fast' failed
make[1]: *** [cmTC_faeb5/fast] Error 2
make[1]: Leaving directory '/home/vagrant/slave/monero-static-ubuntu-amd64/build/build/release/CMakeFiles/CMakeTmp'

File /home/vagrant/slave/monero-static-ubuntu-amd64/build/build/release/CMakeFiles/CMakeTmp/CheckSymbolExists.c:
/* */
#include <pthread.h>

int main(int argc, char** argv)
{
  (void)argv;
#ifndef pthread_rwlock_t
  return ((int*)(&pthread_rwlock_t))[argc];
#else
  (void)argc;
  return 0;
#endif
}

Determining if the pthread_spinlock_t exist failed with the following output:
Change Dir: /home/vagrant/slave/monero-static-ubuntu-amd64/build/build/release/CMakeFiles/CMakeTmp

Run Build Command:"/usr/bin/make" "cmTC_89bb6/fast"
make[1]: Entering directory '/home/vagrant/slave/monero-static-ubuntu-amd64/build/build/release/CMakeFiles/CMakeTmp'
/usr/bin/make -f CMakeFiles/cmTC_89bb6.dir/build.make CMakeFiles/cmTC_89bb6.dir/build
make[2]: Entering directory '/home/vagrant/slave/monero-static-ubuntu-amd64/build/build/release/CMakeFiles/CMakeTmp'
Building C object CMakeFiles/cmTC_89bb6.dir/CheckSymbolExists.c.o
/usr/bin/cc    -pthread    -o CMakeFiles/cmTC_89bb6.dir/CheckSymbolExists.c.o   -c /home/vagrant/slave/monero-static-ubuntu-amd64/build/build/release/CMakeFiles/CMakeTmp/CheckSymbolExists.c
/home/vagrant/slave/monero-static-ubuntu-amd64/build/build/release/CMakeFiles/CMakeTmp/CheckSymbolExists.c: In function 'main':
/home/vagrant/slave/monero-static-ubuntu-amd64/build/build/release/CMakeFiles/CMakeTmp/CheckSymbolExists.c:8:19: error: expected expression before 'pthread_spinlock_t'
   return ((int*)(&pthread_spinlock_t))[argc];
                   ^
CMakeFiles/cmTC_89bb6.dir/build.make:65: recipe for target 'CMakeFiles/cmTC_89bb6.dir/CheckSymbolExists.c.o' failed
make[2]: *** [CMakeFiles/cmTC_89bb6.dir/CheckSymbolExists.c.o] Error 1
make[2]: Leaving directory '/home/vagrant/slave/monero-static-ubuntu-amd64/build/build/release/CMakeFiles/CMakeTmp'
Makefile:126: recipe for target 'cmTC_89bb6/fast' failed
make[1]: *** [cmTC_89bb6/fast] Error 2
make[1]: Leaving directory '/home/vagrant/slave/monero-static-ubuntu-amd64/build/build/release/CMakeFiles/CMakeTmp'

File /home/vagrant/slave/monero-static-ubuntu-amd64/build/build/release/CMakeFiles/CMakeTmp/CheckSymbolExists.c:
/* */
#include <pthread.h>

int main(int argc, char** argv)
{
  (void)argv;
#ifndef pthread_spinlock_t
  return ((int*)(&pthread_spinlock_t))[argc];
#else
  (void)argc;
  return 0;
#endif
}

Determining if the function EVP_MD_CTX_new exists failed with the following output:
Change Dir: /home/vagrant/slave/monero-static-ubuntu-amd64/build/build/release/CMakeFiles/CMakeTmp

Run Build Command:"/usr/bin/make" "cmTC_836ce/fast"
make[1]: Entering directory '/home/vagrant/slave/monero-static-ubuntu-amd64/build/build/release/CMakeFiles/CMakeTmp'
/usr/bin/make -f CMakeFiles/cmTC_836ce.dir/build.make CMakeFiles/cmTC_836ce.dir/build
make[2]: Entering directory '/home/vagrant/slave/monero-static-ubuntu-amd64/build/build/release/CMakeFiles/CMakeTmp'
Building C object CMakeFiles/cmTC_836ce.dir/CheckFunctionExists.c.o
/usr/bin/cc    -pthread -DCHECK_FUNCTION_EXISTS=EVP_MD_CTX_new   -o CMakeFiles/cmTC_836ce.dir/CheckFunctionExists.c.o   -c /usr/share/cmake-3.5/Modules/CheckFunctionExists.c
Linking C executable cmTC_836ce
/usr/bin/cmake -E cmake_link_script CMakeFiles/cmTC_836ce.dir/link.txt --verbose=1
/usr/bin/cc   -pthread -DCHECK_FUNCTION_EXISTS=EVP_MD_CTX_new    CMakeFiles/cmTC_836ce.dir/CheckFunctionExists.c.o  -o cmTC_836ce -rdynamic /usr/lib/x86_64-linux-gnu/libssl.a /usr/lib/x86_64-linux-gnu/libcrypto.a -ldl -pthread 
CMakeFiles/cmTC_836ce.dir/CheckFunctionExists.c.o: In function `main':
CheckFunctionExists.c:(.text+0x15): undefined reference to `EVP_MD_CTX_new'
collect2: error: ld returned 1 exit status
CMakeFiles/cmTC_836ce.dir/build.make:99: recipe for target 'cmTC_836ce' failed
make[2]: *** [cmTC_836ce] Error 1
make[2]: Leaving directory '/home/vagrant/slave/monero-static-ubuntu-amd64/build/build/release/CMakeFiles/CMakeTmp'
Makefile:126: recipe for target 'cmTC_836ce/fast' failed
make[1]: *** [cmTC_836ce/fast] Error 2
make[1]: Leaving directory '/home/vagrant/slave/monero-static-ubuntu-amd64/build/build/release/CMakeFiles/CMakeTmp'


Determining if the LIBRESSL_VERSION_TEXT exist failed with the following output:
Change Dir: /home/vagrant/slave/monero-static-ubuntu-amd64/build/build/release/CMakeFiles/CMakeTmp

Run Build Command:"/usr/bin/make" "cmTC_e902a/fast"
make[1]: Entering directory '/home/vagrant/slave/monero-static-ubuntu-amd64/build/build/release/CMakeFiles/CMakeTmp'
/usr/bin/make -f CMakeFiles/cmTC_e902a.dir/build.make CMakeFiles/cmTC_e902a.dir/build
make[2]: Entering directory '/home/vagrant/slave/monero-static-ubuntu-amd64/build/build/release/CMakeFiles/CMakeTmp'
Building C object CMakeFiles/cmTC_e902a.dir/CheckSymbolExists.c.o
/usr/bin/cc    -pthread    -o CMakeFiles/cmTC_e902a.dir/CheckSymbolExists.c.o   -c /home/vagrant/slave/monero-static-ubuntu-amd64/build/build/release/CMakeFiles/CMakeTmp/CheckSymbolExists.c
/home/vagrant/slave/monero-static-ubuntu-amd64/build/build/release/CMakeFiles/CMakeTmp/CheckSymbolExists.c: In function 'main':
/home/vagrant/slave/monero-static-ubuntu-amd64/build/build/release/CMakeFiles/CMakeTmp/CheckSymbolExists.c:8:19: error: 'LIBRESSL_VERSION_TEXT' undeclared (first use in this function)
   return ((int*)(&LIBRESSL_VERSION_TEXT))[argc];
                   ^
/home/vagrant/slave/monero-static-ubuntu-amd64/build/build/release/CMakeFiles/CMakeTmp/CheckSymbolExists.c:8:19: note: each undeclared identifier is reported only once for each function it appears in
CMakeFiles/cmTC_e902a.dir/build.make:65: recipe for target 'CMakeFiles/cmTC_e902a.dir/CheckSymbolExists.c.o' failed
make[2]: *** [CMakeFiles/cmTC_e902a.dir/CheckSymbolExists.c.o] Error 1
make[2]: Leaving directory '/home/vagrant/slave/monero-static-ubuntu-amd64/build/build/release/CMakeFiles/CMakeTmp'
Makefile:126: recipe for target 'cmTC_e902a/fast' failed
make[1]: *** [cmTC_e902a/fast] Error 2
make[1]: Leaving directory '/home/vagrant/slave/monero-static-ubuntu-amd64/build/build/release/CMakeFiles/CMakeTmp'

File /home/vagrant/slave/monero-static-ubuntu-amd64/build/build/release/CMakeFiles/CMakeTmp/CheckSymbolExists.c:
/* */
#include <openssl/opensslv.h>

int main(int argc, char** argv)
{
  (void)argv;
#ifndef LIBRESSL_VERSION_TEXT
  return ((int*)(&LIBRESSL_VERSION_TEXT))[argc];
#else
  (void)argc;
  return 0;
#endif
}

Performing C++ SOURCE FILE Test HAVE_CXX_ATOMICS failed with the following output:
Change Dir: /home/vagrant/slave/monero-static-ubuntu-amd64/build/build/release/CMakeFiles/CMakeTmp

Run Build Command:"/usr/bin/make" "cmTC_62b02/fast"
make[1]: Entering directory '/home/vagrant/slave/monero-static-ubuntu-amd64/build/build/release/CMakeFiles/CMakeTmp'
/usr/bin/make -f CMakeFiles/cmTC_62b02.dir/build.make CMakeFiles/cmTC_62b02.dir/build
make[2]: Entering directory '/home/vagrant/slave/monero-static-ubuntu-amd64/build/build/release/CMakeFiles/CMakeTmp'
Building CXX object CMakeFiles/cmTC_62b02.dir/src.cxx.o
/usr/bin/c++     -DZMQ_STATIC -pthread -maes -DHAVE_CXX_ATOMICS   -o CMakeFiles/cmTC_62b02.dir/src.cxx.o -c /home/vagrant/slave/monero-static-ubuntu-amd64/build/build/release/CMakeFiles/CMakeTmp/src.cxx
In file included from /usr/include/c++/5/cstdint:35:0,
                 from /home/vagrant/slave/monero-static-ubuntu-amd64/build/build/release/CMakeFiles/CMakeTmp/src.cxx:2:
/usr/include/c++/5/bits/c++0x_warning.h:32:2: error: #error This file requires compiler and library support for the ISO C++ 2011 standard. This support must be enabled with the -std=c++11 or -std=gnu++11 compiler options.
 #error This file requires compiler and library support \
  ^
/home/vagrant/slave/monero-static-ubuntu-amd64/build/build/release/CMakeFiles/CMakeTmp/src.cxx: In function 'int main()':
/home/vagrant/slave/monero-static-ubuntu-amd64/build/build/release/CMakeFiles/CMakeTmp/src.cxx:5:3: error: 'atomic' is not a member of 'std'
   std::atomic<uint64_t> a;
   ^
/home/vagrant/slave/monero-static-ubuntu-amd64/build/build/release/CMakeFiles/CMakeTmp/src.cxx:5:15: error: 'uint64_t' was not declared in this scope
   std::atomic<uint64_t> a;
               ^
/home/vagrant/slave/monero-static-ubuntu-amd64/build/build/release/CMakeFiles/CMakeTmp/src.cxx:5:25: error: 'a' was not declared in this scope
   std::atomic<uint64_t> a;
                         ^
CMakeFiles/cmTC_62b02.dir/build.make:65: recipe for target 'CMakeFiles/cmTC_62b02.dir/src.cxx.o' failed
make[2]: *** [CMakeFiles/cmTC_62b02.dir/src.cxx.o] Error 1
make[2]: Leaving directory '/home/vagrant/slave/monero-static-ubuntu-amd64/build/build/release/CMakeFiles/CMakeTmp'
Makefile:126: recipe for target 'cmTC_62b02/fast' failed
make[1]: *** [cmTC_62b02/fast] Error 2
make[1]: Leaving directory '/home/vagrant/slave/monero-static-ubuntu-amd64/build/build/release/CMakeFiles/CMakeTmp'

Source file was:

#include <cstdint>
#include <atomic>
int main() {
  std::atomic<uint64_t> a;
  a.is_lock_free();
}
Performing C SOURCE FILE Test _fcf_protection=full_c failed with the following output:
Change Dir: /home/vagrant/slave/monero-static-ubuntu-amd64/build/build/release/CMakeFiles/CMakeTmp

Run Build Command:"/usr/bin/make" "cmTC_9be80/fast"
make[1]: Entering directory '/home/vagrant/slave/monero-static-ubuntu-amd64/build/build/release/CMakeFiles/CMakeTmp'
/usr/bin/make -f CMakeFiles/cmTC_9be80.dir/build.make CMakeFiles/cmTC_9be80.dir/build
make[2]: Entering directory '/home/vagrant/slave/monero-static-ubuntu-amd64/build/build/release/CMakeFiles/CMakeTmp'
Building C object CMakeFiles/cmTC_9be80.dir/src.c.o
/usr/bin/cc   -I/usr/local/include/libusb-1.0  -pthread -maes -march=x86-64 -fno-strict-aliasing -D_fcf_protection=full_c   -fcf-protection=full -o CMakeFiles/cmTC_9be80.dir/src.c.o   -c /home/vagrant/slave/monero-static-ubuntu-amd64/build/build/release/CMakeFiles/CMakeTmp/src.c
cc: error: unrecognized command line option '-fcf-protection=full'
CMakeFiles/cmTC_9be80.dir/build.make:65: recipe for target 'CMakeFiles/cmTC_9be80.dir/src.c.o' failed
make[2]: *** [CMakeFiles/cmTC_9be80.dir/src.c.o] Error 1
make[2]: Leaving directory '/home/vagrant/slave/monero-static-ubuntu-amd64/build/build/release/CMakeFiles/CMakeTmp'
Makefile:126: recipe for target 'cmTC_9be80/fast' failed
make[1]: *** [cmTC_9be80/fast] Error 2
make[1]: Leaving directory '/home/vagrant/slave/monero-static-ubuntu-amd64/build/build/release/CMakeFiles/CMakeTmp'

Source file was:
int main(void) { return 0; }
Performing C++ SOURCE FILE Test _fcf_protection=full_cxx failed with the following output:
Change Dir: /home/vagrant/slave/monero-static-ubuntu-amd64/build/build/release/CMakeFiles/CMakeTmp

Run Build Command:"/usr/bin/make" "cmTC_e6f63/fast"
make[1]: Entering directory '/home/vagrant/slave/monero-static-ubuntu-amd64/build/build/release/CMakeFiles/CMakeTmp'
/usr/bin/make -f CMakeFiles/cmTC_e6f63.dir/build.make CMakeFiles/cmTC_e6f63.dir/build
make[2]: Entering directory '/home/vagrant/slave/monero-static-ubuntu-amd64/build/build/release/CMakeFiles/CMakeTmp'
Building CXX object CMakeFiles/cmTC_e6f63.dir/src.cxx.o
/usr/bin/c++    -I/usr/local/include/libusb-1.0  -DZMQ_STATIC -pthread -maes -march=x86-64 -fno-strict-aliasing -D_fcf_protection=full_cxx   -fcf-protection=full -o CMakeFiles/cmTC_e6f63.dir/src.cxx.o -c /home/vagrant/slave/monero-static-ubuntu-amd64/build/build/release/CMakeFiles/CMakeTmp/src.cxx
c++: error: unrecognized command line option '-fcf-protection=full'
CMakeFiles/cmTC_e6f63.dir/build.make:65: recipe for target 'CMakeFiles/cmTC_e6f63.dir/src.cxx.o' failed
make[2]: *** [CMakeFiles/cmTC_e6f63.dir/src.cxx.o] Error 1
make[2]: Leaving directory '/home/vagrant/slave/monero-static-ubuntu-amd64/build/build/release/CMakeFiles/CMakeTmp'
Makefile:126: recipe for target 'cmTC_e6f63/fast' failed
make[1]: *** [cmTC_e6f63/fast] Error 2
make[1]: Leaving directory '/home/vagrant/slave/monero-static-ubuntu-amd64/build/build/release/CMakeFiles/CMakeTmp'

Source file was:
int main() { return 0; }
Performing C SOURCE FILE Test _fstack_clash_protection_c failed with the following output:
Change Dir: /home/vagrant/slave/monero-static-ubuntu-amd64/build/build/release/CMakeFiles/CMakeTmp

Run Build Command:"/usr/bin/make" "cmTC_9432b/fast"
make[1]: Entering directory '/home/vagrant/slave/monero-static-ubuntu-amd64/build/build/release/CMakeFiles/CMakeTmp'
/usr/bin/make -f CMakeFiles/cmTC_9432b.dir/build.make CMakeFiles/cmTC_9432b.dir/build
make[2]: Entering directory '/home/vagrant/slave/monero-static-ubuntu-amd64/build/build/release/CMakeFiles/CMakeTmp'
Building C object CMakeFiles/cmTC_9432b.dir/src.c.o
/usr/bin/cc   -I/usr/local/include/libusb-1.0  -pthread -maes -march=x86-64 -fno-strict-aliasing -D_fstack_clash_protection_c   -fstack-clash-protection -o CMakeFiles/cmTC_9432b.dir/src.c.o   -c /home/vagrant/slave/monero-static-ubuntu-amd64/build/build/release/CMakeFiles/CMakeTmp/src.c
cc: error: unrecognized command line option '-fstack-clash-protection'
CMakeFiles/cmTC_9432b.dir/build.make:65: recipe for target 'CMakeFiles/cmTC_9432b.dir/src.c.o' failed
make[2]: *** [CMakeFiles/cmTC_9432b.dir/src.c.o] Error 1
make[2]: Leaving directory '/home/vagrant/slave/monero-static-ubuntu-amd64/build/build/release/CMakeFiles/CMakeTmp'
Makefile:126: recipe for target 'cmTC_9432b/fast' failed
make[1]: *** [cmTC_9432b/fast] Error 2
make[1]: Leaving directory '/home/vagrant/slave/monero-static-ubuntu-amd64/build/build/release/CMakeFiles/CMakeTmp'

Source file was:
int main(void) { return 0; }
Performing C++ SOURCE FILE Test _fstack_clash_protection_cxx failed with the following output:
Change Dir: /home/vagrant/slave/monero-static-ubuntu-amd64/build/build/release/CMakeFiles/CMakeTmp

Run Build Command:"/usr/bin/make" "cmTC_d3a53/fast"
make[1]: Entering directory '/home/vagrant/slave/monero-static-ubuntu-amd64/build/build/release/CMakeFiles/CMakeTmp'
/usr/bin/make -f CMakeFiles/cmTC_d3a53.dir/build.make CMakeFiles/cmTC_d3a53.dir/build
make[2]: Entering directory '/home/vagrant/slave/monero-static-ubuntu-amd64/build/build/release/CMakeFiles/CMakeTmp'
Building CXX object CMakeFiles/cmTC_d3a53.dir/src.cxx.o
/usr/bin/c++    -I/usr/local/include/libusb-1.0  -DZMQ_STATIC -pthread -maes -march=x86-64 -fno-strict-aliasing -D_fstack_clash_protection_cxx   -fstack-clash-protection -o CMakeFiles/cmTC_d3a53.dir/src.cxx.o -c /home/vagrant/slave/monero-static-ubuntu-amd64/build/build/release/CMakeFiles/CMakeTmp/src.cxx
c++: error: unrecognized command line option '-fstack-clash-protection'
CMakeFiles/cmTC_d3a53.dir/build.make:65: recipe for target 'CMakeFiles/cmTC_d3a53.dir/src.cxx.o' failed
make[2]: *** [CMakeFiles/cmTC_d3a53.dir/src.cxx.o] Error 1
make[2]: Leaving directory '/home/vagrant/slave/monero-static-ubuntu-amd64/build/build/release/CMakeFiles/CMakeTmp'
Makefile:126: recipe for target 'cmTC_d3a53/fast' failed
make[1]: *** [cmTC_d3a53/fast] Error 2
make[1]: Leaving directory '/home/vagrant/slave/monero-static-ubuntu-amd64/build/build/release/CMakeFiles/CMakeTmp'

Source file was:
int main() { return 0; }
Performing C SOURCE FILE Test _mmitigate_rop_c failed with the following output:
Change Dir: /home/vagrant/slave/monero-static-ubuntu-amd64/build/build/release/CMakeFiles/CMakeTmp

Run Build Command:"/usr/bin/make" "cmTC_8a90e/fast"
make[1]: Entering directory '/home/vagrant/slave/monero-static-ubuntu-amd64/build/build/release/CMakeFiles/CMakeTmp'
/usr/bin/make -f CMakeFiles/cmTC_8a90e.dir/build.make CMakeFiles/cmTC_8a90e.dir/build
make[2]: Entering directory '/home/vagrant/slave/monero-static-ubuntu-amd64/build/build/release/CMakeFiles/CMakeTmp'
Building C object CMakeFiles/cmTC_8a90e.dir/src.c.o
/usr/bin/cc   -I/usr/local/include/libusb-1.0  -pthread -maes -march=x86-64 -fno-strict-aliasing -D_mmitigate_rop_c   -mmitigate-rop -o CMakeFiles/cmTC_8a90e.dir/src.c.o   -c /home/vagrant/slave/monero-static-ubuntu-amd64/build/build/release/CMakeFiles/CMakeTmp/src.c
cc: error: unrecognized command line option '-mmitigate-rop'
CMakeFiles/cmTC_8a90e.dir/build.make:65: recipe for target 'CMakeFiles/cmTC_8a90e.dir/src.c.o' failed
make[2]: *** [CMakeFiles/cmTC_8a90e.dir/src.c.o] Error 1
make[2]: Leaving directory '/home/vagrant/slave/monero-static-ubuntu-amd64/build/build/release/CMakeFiles/CMakeTmp'
Makefile:126: recipe for target 'cmTC_8a90e/fast' failed
make[1]: *** [cmTC_8a90e/fast] Error 2
make[1]: Leaving directory '/home/vagrant/slave/monero-static-ubuntu-amd64/build/build/release/CMakeFiles/CMakeTmp'

Source file was:
int main(void) { return 0; }
Performing C++ SOURCE FILE Test _mmitigate_rop_cxx failed with the following output:
Change Dir: /home/vagrant/slave/monero-static-ubuntu-amd64/build/build/release/CMakeFiles/CMakeTmp

Run Build Command:"/usr/bin/make" "cmTC_9e024/fast"
make[1]: Entering directory '/home/vagrant/slave/monero-static-ubuntu-amd64/build/build/release/CMakeFiles/CMakeTmp'
/usr/bin/make -f CMakeFiles/cmTC_9e024.dir/build.make CMakeFiles/cmTC_9e024.dir/build
make[2]: Entering directory '/home/vagrant/slave/monero-static-ubuntu-amd64/build/build/release/CMakeFiles/CMakeTmp'
Building CXX object CMakeFiles/cmTC_9e024.dir/src.cxx.o
/usr/bin/c++    -I/usr/local/include/libusb-1.0  -DZMQ_STATIC -pthread -maes -march=x86-64 -fno-strict-aliasing -D_mmitigate_rop_cxx   -mmitigate-rop -o CMakeFiles/cmTC_9e024.dir/src.cxx.o -c /home/vagrant/slave/monero-static-ubuntu-amd64/build/build/release/CMakeFiles/CMakeTmp/src.cxx
c++: error: unrecognized command line option '-mmitigate-rop'
CMakeFiles/cmTC_9e024.dir/build.make:65: recipe for target 'CMakeFiles/cmTC_9e024.dir/src.cxx.o' failed
make[2]: *** [CMakeFiles/cmTC_9e024.dir/src.cxx.o] Error 1
make[2]: Leaving directory '/home/vagrant/slave/monero-static-ubuntu-amd64/build/build/release/CMakeFiles/CMakeTmp'
Makefile:126: recipe for target 'cmTC_9e024/fast' failed
make[1]: *** [cmTC_9e024/fast] Error 2
make[1]: Leaving directory '/home/vagrant/slave/monero-static-ubuntu-amd64/build/build/release/CMakeFiles/CMakeTmp'

Source file was:
int main() { return 0; }
Determining if the -Wl,-z,noexecheap linker flag is supported failed with the following output:
Change Dir: /home/vagrant/slave/monero-static-ubuntu-amd64/build/build/release/CMakeFiles/CMakeTmp

Run Build Command:"/usr/bin/make" "cmTC_da09d/fast"
make[1]: Entering directory '/home/vagrant/slave/monero-static-ubuntu-amd64/build/build/release/CMakeFiles/CMakeTmp'
/usr/bin/make -f CMakeFiles/cmTC_da09d.dir/build.make CMakeFiles/cmTC_da09d.dir/build
make[2]: Entering directory '/home/vagrant/slave/monero-static-ubuntu-amd64/build/build/release/CMakeFiles/CMakeTmp'
Building C object CMakeFiles/cmTC_da09d.dir/CheckLinkerFlag.c.o
/usr/bin/cc    -Wl,-z,noexecheap    -Wl,-z,noexecheap -o CMakeFiles/cmTC_da09d.dir/CheckLinkerFlag.c.o   -c /home/vagrant/slave/monero-static-ubuntu-amd64/build/cmake/CheckLinkerFlag.c
Linking C executable cmTC_da09d
/usr/bin/cmake -E cmake_link_script CMakeFiles/cmTC_da09d.dir/link.txt --verbose=1
/usr/bin/cc  -Wl,-z,noexecheap     CMakeFiles/cmTC_da09d.dir/CheckLinkerFlag.c.o  -o cmTC_da09d -rdynamic 
/usr/bin/ld: warning: -z noexecheap ignored.
make[2]: Leaving directory '/home/vagrant/slave/monero-static-ubuntu-amd64/build/build/release/CMakeFiles/CMakeTmp'
make[1]: Leaving directory '/home/vagrant/slave/monero-static-ubuntu-amd64/build/build/release/CMakeFiles/CMakeTmp'


Determining if the function rl_copy_text exists failed with the following output:
Change Dir: /home/vagrant/slave/monero-static-ubuntu-amd64/build/build/release/CMakeFiles/CMakeTmp

Run Build Command:"/usr/bin/make" "cmTC_064da/fast"
make[1]: Entering directory '/home/vagrant/slave/monero-static-ubuntu-amd64/build/build/release/CMakeFiles/CMakeTmp'
/usr/bin/make -f CMakeFiles/cmTC_064da.dir/build.make CMakeFiles/cmTC_064da.dir/build
make[2]: Entering directory '/home/vagrant/slave/monero-static-ubuntu-amd64/build/build/release/CMakeFiles/CMakeTmp'
Building C object CMakeFiles/cmTC_064da.dir/CheckFunctionExists.c.o
/usr/bin/cc    -pthread -maes -march=x86-64 -fno-strict-aliasing -std=c11 -D_GNU_SOURCE   -Wall -Wextra -Wpointer-arith -Wundef -Wvla -Wwrite-strings -Wno-error=extra -Wno-error=deprecated-declarations -Wno-unused-parameter -Wno-unused-variable -Wno-error=unused-variable -Wno-error=undef -Wno-error=uninitialized -Wlogical-op -Wno-error=maybe-uninitialized -Wno-error=cpp -Waggregate-return -Wnested-externs -Wold-style-definition -Wstrict-prototypes  -fPIC  -Wformat -Wformat-security -fstack-protector -fstack-protector-strong -fno-strict-aliasing -DCHECK_FUNCTION_EXISTS=rl_copy_text   -o CMakeFiles/cmTC_064da.dir/CheckFunctionExists.c.o   -c /usr/share/cmake-3.5/Modules/CheckFunctionExists.c
/usr/share/cmake-3.5/Modules/CheckFunctionExists.c:6:1: warning: function declaration isn't a prototype [-Wstrict-prototypes]
 char CHECK_FUNCTION_EXISTS();
 ^
Linking C executable cmTC_064da
/usr/bin/cmake -E cmake_link_script CMakeFiles/cmTC_064da.dir/link.txt --verbose=1
/usr/bin/cc   -pthread -maes -march=x86-64 -fno-strict-aliasing -std=c11 -D_GNU_SOURCE   -Wall -Wextra -Wpointer-arith -Wundef -Wvla -Wwrite-strings -Wno-error=extra -Wno-error=deprecated-declarations -Wno-unused-parameter -Wno-unused-variable -Wno-error=unused-variable -Wno-error=undef -Wno-error=uninitialized -Wlogical-op -Wno-error=maybe-uninitialized -Wno-error=cpp -Waggregate-return -Wnested-externs -Wold-style-definition -Wstrict-prototypes  -fPIC  -Wformat -Wformat-security -fstack-protector -fstack-protector-strong -fno-strict-aliasing -DCHECK_FUNCTION_EXISTS=rl_copy_text    CMakeFiles/cmTC_064da.dir/CheckFunctionExists.c.o  -o cmTC_064da -rdynamic /usr/lib/x86_64-linux-gnu/libreadline.a 
/usr/lib/x86_64-linux-gnu/libreadline.a(terminal.o): In function `_rl_get_screen_size':
(.text+0x283): undefined reference to `tgetnum'
/usr/lib/x86_64-linux-gnu/libreadline.a(terminal.o): In function `_rl_get_screen_size':
(.text+0x303): undefined reference to `tgetnum'
/usr/lib/x86_64-linux-gnu/libreadline.a(terminal.o): In function `_rl_init_terminal_io':
(.text+0x6fa): undefined reference to `PC'
/usr/lib/x86_64-linux-gnu/libreadline.a(terminal.o): In function `_rl_init_terminal_io':
(.text+0x70e): undefined reference to `BC'
/usr/lib/x86_64-linux-gnu/libreadline.a(terminal.o): In function `_rl_init_terminal_io':
(.text+0x718): undefined reference to `UP'
/usr/lib/x86_64-linux-gnu/libreadline.a(terminal.o): In function `_rl_init_terminal_io':
(.text+0x7a8): undefined reference to `tgetent'
/usr/lib/x86_64-linux-gnu/libreadline.a(terminal.o): In function `_rl_init_terminal_io':
(.text+0x7e7): undefined reference to `tgetstr'
/usr/lib/x86_64-linux-gnu/libreadline.a(terminal.o): In function `_rl_init_terminal_io':
(.text+0x817): undefined reference to `PC'
/usr/lib/x86_64-linux-gnu/libreadline.a(terminal.o): In function `_rl_init_terminal_io':
(.text+0x82e): undefined reference to `BC'
/usr/lib/x86_64-linux-gnu/libreadline.a(terminal.o): In function `_rl_init_terminal_io':
(.text+0x842): undefined reference to `UP'
/usr/lib/x86_64-linux-gnu/libreadline.a(terminal.o): In function `_rl_init_terminal_io':
(.text+0x857): undefined reference to `tgetflag'
/usr/lib/x86_64-linux-gnu/libreadline.a(terminal.o): In function `_rl_init_terminal_io':
(.text+0x8b1): undefined reference to `tgetflag'
/usr/lib/x86_64-linux-gnu/libreadline.a(terminal.o): In function `_rl_init_terminal_io':
(.text+0x91f): undefined reference to `tgetflag'
/usr/lib/x86_64-linux-gnu/libreadline.a(terminal.o): In function `_rl_init_terminal_io':
(.text+0x9fb): undefined reference to `tgetent'
/usr/lib/x86_64-linux-gnu/libreadline.a(terminal.o): In function `_rl_backspace':
(.text+0xc00): undefined reference to `tputs'
/usr/lib/x86_64-linux-gnu/libreadline.a(terminal.o): In function `rl_ding':
(.text+0xcaa): undefined reference to `tputs'
/usr/lib/x86_64-linux-gnu/libreadline.a(terminal.o): In function `_rl_enable_meta_key':
(.text+0xd17): undefined reference to `tputs'
/usr/lib/x86_64-linux-gnu/libreadline.a(terminal.o): In function `_rl_disable_meta_key':
(.text+0xd69): undefined reference to `tputs'
/usr/lib/x86_64-linux-gnu/libreadline.a(terminal.o): In function `_rl_control_keypad':
(.text+0xd9d): undefined reference to `tputs'
/usr/lib/x86_64-linux-gnu/libreadline.a(terminal.o):(.text+0xdf0): more undefined references to `tputs' follow
/usr/lib/x86_64-linux-gnu/libreadline.a(display.o): In function `update_line':
(.text+0x238e): undefined reference to `tgoto'
/usr/lib/x86_64-linux-gnu/libreadline.a(display.o): In function `update_line':
(.text+0x23a2): undefined reference to `tputs'
/usr/lib/x86_64-linux-gnu/libreadline.a(display.o): In function `update_line':
(.text+0x2520): undefined reference to `tputs'
/usr/lib/x86_64-linux-gnu/libreadline.a(display.o): In function `update_line':
(.text+0x2d49): undefined reference to `tputs'
/usr/lib/x86_64-linux-gnu/libreadline.a(display.o): In function `update_line':
(.text+0x2e7a): undefined reference to `tgoto'
/usr/lib/x86_64-linux-gnu/libreadline.a(display.o): In function `update_line':
(.text+0x2e8c): undefined reference to `tputs'
/usr/lib/x86_64-linux-gnu/libreadline.a(display.o): In function `update_line':
(.text+0x3056): undefined reference to `tputs'
/usr/lib/x86_64-linux-gnu/libreadline.a(display.o): In function `update_line':
(.text+0x309f): undefined reference to `tputs'
/usr/lib/x86_64-linux-gnu/libreadline.a(display.o): In function `update_line':
(.text+0x30d1): undefined reference to `tputs'
/usr/lib/x86_64-linux-gnu/libreadline.a(display.o): In function `rl_redisplay':
(.text+0x4813): undefined reference to `tputs'
/usr/lib/x86_64-linux-gnu/libreadline.a(display.o):(.text+0x4b2a): more undefined references to `tputs' follow
collect2: error: ld returned 1 exit status
CMakeFiles/cmTC_064da.dir/build.make:98: recipe for target 'cmTC_064da' failed
make[2]: *** [cmTC_064da] Error 1
make[2]: Leaving directory '/home/vagrant/slave/monero-static-ubuntu-amd64/build/build/release/CMakeFiles/CMakeTmp'
Makefile:126: recipe for target 'cmTC_064da/fast' failed
make[1]: *** [cmTC_064da/fast] Error 2
make[1]: Leaving directory '/home/vagrant/slave/monero-static-ubuntu-amd64/build/build/release/CMakeFiles/CMakeTmp'


Determining if the function rl_filename_completion_function exists failed with the following output:
Change Dir: /home/vagrant/slave/monero-static-ubuntu-amd64/build/build/release/CMakeFiles/CMakeTmp

Run Build Command:"/usr/bin/make" "cmTC_2b2a6/fast"
make[1]: Entering directory '/home/vagrant/slave/monero-static-ubuntu-amd64/build/build/release/CMakeFiles/CMakeTmp'
/usr/bin/make -f CMakeFiles/cmTC_2b2a6.dir/build.make CMakeFiles/cmTC_2b2a6.dir/build
make[2]: Entering directory '/home/vagrant/slave/monero-static-ubuntu-amd64/build/build/release/CMakeFiles/CMakeTmp'
Building C object CMakeFiles/cmTC_2b2a6.dir/CheckFunctionExists.c.o
/usr/bin/cc    -pthread -maes -march=x86-64 -fno-strict-aliasing -std=c11 -D_GNU_SOURCE   -Wall -Wextra -Wpointer-arith -Wundef -Wvla -Wwrite-strings -Wno-error=extra -Wno-error=deprecated-declarations -Wno-unused-parameter -Wno-unused-variable -Wno-error=unused-variable -Wno-error=undef -Wno-error=uninitialized -Wlogical-op -Wno-error=maybe-uninitialized -Wno-error=cpp -Waggregate-return -Wnested-externs -Wold-style-definition -Wstrict-prototypes  -fPIC  -Wformat -Wformat-security -fstack-protector -fstack-protector-strong -fno-strict-aliasing -DCHECK_FUNCTION_EXISTS=rl_filename_completion_function   -o CMakeFiles/cmTC_2b2a6.dir/CheckFunctionExists.c.o   -c /usr/share/cmake-3.5/Modules/CheckFunctionExists.c
/usr/share/cmake-3.5/Modules/CheckFunctionExists.c:6:1: warning: function declaration isn't a prototype [-Wstrict-prototypes]
 char CHECK_FUNCTION_EXISTS();
 ^
Linking C executable cmTC_2b2a6
/usr/bin/cmake -E cmake_link_script CMakeFiles/cmTC_2b2a6.dir/link.txt --verbose=1
/usr/bin/cc   -pthread -maes -march=x86-64 -fno-strict-aliasing -std=c11 -D_GNU_SOURCE   -Wall -Wextra -Wpointer-arith -Wundef -Wvla -Wwrite-strings -Wno-error=extra -Wno-error=deprecated-declarations -Wno-unused-parameter -Wno-unused-variable -Wno-error=unused-variable -Wno-error=undef -Wno-error=uninitialized -Wlogical-op -Wno-error=maybe-uninitialized -Wno-error=cpp -Waggregate-return -Wnested-externs -Wold-style-definition -Wstrict-prototypes  -fPIC  -Wformat -Wformat-security -fstack-protector -fstack-protector-strong -fno-strict-aliasing -DCHECK_FUNCTION_EXISTS=rl_filename_completion_function    CMakeFiles/cmTC_2b2a6.dir/CheckFunctionExists.c.o  -o cmTC_2b2a6 -rdynamic /usr/lib/x86_64-linux-gnu/libreadline.a 
/usr/lib/x86_64-linux-gnu/libreadline.a(display.o): In function `_rl_move_cursor_relative':
(.text+0xecc): undefined reference to `tputs'
/usr/lib/x86_64-linux-gnu/libreadline.a(display.o): In function `_rl_move_cursor_relative':
(.text+0xf2e): undefined reference to `tputs'
/usr/lib/x86_64-linux-gnu/libreadline.a(display.o): In function `_rl_move_cursor_relative':
(.text+0x1021): undefined reference to `tputs'
/usr/lib/x86_64-linux-gnu/libreadline.a(display.o): In function `_rl_move_vert':
(.text+0x10cc): undefined reference to `tputs'
/usr/lib/x86_64-linux-gnu/libreadline.a(display.o): In function `_rl_move_vert':
(.text+0x1128): undefined reference to `tputs'
/usr/lib/x86_64-linux-gnu/libreadline.a(display.o): In function `update_line':
(.text+0x238e): undefined reference to `tgoto'
/usr/lib/x86_64-linux-gnu/libreadline.a(display.o): In function `update_line':
(.text+0x23a2): undefined reference to `tputs'
/usr/lib/x86_64-linux-gnu/libreadline.a(display.o): In function `update_line':
(.text+0x2520): undefined reference to `tputs'
/usr/lib/x86_64-linux-gnu/libreadline.a(display.o): In function `update_line':
(.text+0x2d49): undefined reference to `tputs'
/usr/lib/x86_64-linux-gnu/libreadline.a(display.o): In function `update_line':
(.text+0x2e7a): undefined reference to `tgoto'
/usr/lib/x86_64-linux-gnu/libreadline.a(display.o): In function `update_line':
(.text+0x2e8c): undefined reference to `tputs'
/usr/lib/x86_64-linux-gnu/libreadline.a(display.o): In function `update_line':
(.text+0x3056): undefined reference to `tputs'
/usr/lib/x86_64-linux-gnu/libreadline.a(display.o): In function `update_line':
(.text+0x309f): undefined reference to `tputs'
/usr/lib/x86_64-linux-gnu/libreadline.a(display.o): In function `update_line':
(.text+0x30d1): undefined reference to `tputs'
/usr/lib/x86_64-linux-gnu/libreadline.a(display.o): In function `rl_redisplay':
(.text+0x4813): undefined reference to `tputs'
/usr/lib/x86_64-linux-gnu/libreadline.a(display.o):(.text+0x4b2a): more undefined references to `tputs' follow
/usr/lib/x86_64-linux-gnu/libreadline.a(terminal.o): In function `_rl_get_screen_size':
(.text+0x283): undefined reference to `tgetnum'
/usr/lib/x86_64-linux-gnu/libreadline.a(terminal.o): In function `_rl_get_screen_size':
(.text+0x303): undefined reference to `tgetnum'
/usr/lib/x86_64-linux-gnu/libreadline.a(terminal.o): In function `_rl_init_terminal_io':
(.text+0x6fa): undefined reference to `PC'
/usr/lib/x86_64-linux-gnu/libreadline.a(terminal.o): In function `_rl_init_terminal_io':
(.text+0x70e): undefined reference to `BC'
/usr/lib/x86_64-linux-gnu/libreadline.a(terminal.o): In function `_rl_init_terminal_io':
(.text+0x718): undefined reference to `UP'
/usr/lib/x86_64-linux-gnu/libreadline.a(terminal.o): In function `_rl_init_terminal_io':
(.text+0x7a8): undefined reference to `tgetent'
/usr/lib/x86_64-linux-gnu/libreadline.a(terminal.o): In function `_rl_init_terminal_io':
(.text+0x7e7): undefined reference to `tgetstr'
/usr/lib/x86_64-linux-gnu/libreadline.a(terminal.o): In function `_rl_init_terminal_io':
(.text+0x817): undefined reference to `PC'
/usr/lib/x86_64-linux-gnu/libreadline.a(terminal.o): In function `_rl_init_terminal_io':
(.text+0x82e): undefined reference to `BC'
/usr/lib/x86_64-linux-gnu/libreadline.a(terminal.o): In function `_rl_init_terminal_io':
(.text+0x842): undefined reference to `UP'
/usr/lib/x86_64-linux-gnu/libreadline.a(terminal.o): In function `_rl_init_terminal_io':
(.text+0x857): undefined reference to `tgetflag'
/usr/lib/x86_64-linux-gnu/libreadline.a(terminal.o): In function `_rl_init_terminal_io':
(.text+0x8b1): undefined reference to `tgetflag'
/usr/lib/x86_64-linux-gnu/libreadline.a(terminal.o): In function `_rl_init_terminal_io':
(.text+0x91f): undefined reference to `tgetflag'
/usr/lib/x86_64-linux-gnu/libreadline.a(terminal.o): In function `_rl_init_terminal_io':
(.text+0x9fb): undefined reference to `tgetent'
/usr/lib/x86_64-linux-gnu/libreadline.a(terminal.o): In function `_rl_backspace':
(.text+0xc00): undefined reference to `tputs'
/usr/lib/x86_64-linux-gnu/libreadline.a(terminal.o): In function `rl_ding':
(.text+0xcaa): undefined reference to `tputs'
/usr/lib/x86_64-linux-gnu/libreadline.a(terminal.o): In function `_rl_enable_meta_key':
(.text+0xd17): undefined reference to `tputs'
/usr/lib/x86_64-linux-gnu/libreadline.a(terminal.o): In function `_rl_disable_meta_key':
(.text+0xd69): undefined reference to `tputs'
/usr/lib/x86_64-linux-gnu/libreadline.a(terminal.o): In function `_rl_control_keypad':
(.text+0xd9d): undefined reference to `tputs'
/usr/lib/x86_64-linux-gnu/libreadline.a(terminal.o):(.text+0xdf0): more undefined references to `tputs' follow
collect2: error: ld returned 1 exit status
CMakeFiles/cmTC_2b2a6.dir/build.make:98: recipe for target 'cmTC_2b2a6' failed
make[2]: *** [cmTC_2b2a6] Error 1
make[2]: Leaving directory '/home/vagrant/slave/monero-static-ubuntu-amd64/build/build/release/CMakeFiles/CMakeTmp'
Makefile:126: recipe for target 'cmTC_2b2a6/fast' failed
make[1]: *** [cmTC_2b2a6/fast] Error 2
make[1]: Leaving directory '/home/vagrant/slave/monero-static-ubuntu-amd64/build/build/release/CMakeFiles/CMakeTmp'