(view as text)
Determining if the function memset_s exists in the c failed with the following output:
Change Dir: C:/msys64/home/vagrant/slave/monero-static-win64/build/build/release/CMakeFiles/CMakeTmp

Run Build Command:"C:/msys64/usr/bin/make.exe" "cmTC_d1645/fast"
make[1]: Entering directory '/home/vagrant/slave/monero-static-win64/build/build/release/CMakeFiles/CMakeTmp'
/usr/bin/make -f CMakeFiles/cmTC_d1645.dir/build.make CMakeFiles/cmTC_d1645.dir/build
make[2]: Entering directory '/home/vagrant/slave/monero-static-win64/build/build/release/CMakeFiles/CMakeTmp'
Building C object CMakeFiles/cmTC_d1645.dir/CheckFunctionExists.c.obj

/C/msys64/mingw64/bin/x86_64-w64-mingw32-gcc.exe   -DCHECK_FUNCTION_EXISTS=memset_s   -o CMakeFiles/cmTC_d1645.dir/CheckFunctionExists.c.obj   -c /C/msys64/mingw64/share/cmake-3.12/Modules/CheckFunctionExists.c
Linking C executable cmTC_d1645.exe

/C/msys64/mingw64/bin/cmake.exe -E remove -f CMakeFiles/cmTC_d1645.dir/objects.a
ar cr CMakeFiles/cmTC_d1645.dir/objects.a "CMakeFiles/cmTC_d1645.dir/CheckFunctionExists.c.obj" 
/C/msys64/mingw64/bin/x86_64-w64-mingw32-gcc.exe  -DCHECK_FUNCTION_EXISTS=memset_s    -Wl,--whole-archive CMakeFiles/cmTC_d1645.dir/objects.a -Wl,--no-whole-archive  -o cmTC_d1645.exe -Wl,--major-image-version,0,--minor-image-version,0  -L/C/msys64/home/vagrant/slave/monero-static-win64/build/build/release/CMakeFiles/CMakeTmp/string.h -lc -lkernel32 -luser32 -lgdi32 -lwinspool -lshell32 -lole32 -loleaut32 -luuid -lcomdlg32 -ladvapi32 
C:/msys64/mingw64/bin/../lib/gcc/x86_64-w64-mingw32/8.2.1/../../../../x86_64-w64-mingw32/bin/ld.exe: cannot find -lc

collect2.exe: error: ld returned 1 exit status
make[2]: *** [CMakeFiles/cmTC_d1645.dir/build.make:88: cmTC_d1645.exe] Error 1
make[2]: Leaving directory '/home/vagrant/slave/monero-static-win64/build/build/release/CMakeFiles/CMakeTmp'
make[1]: *** [Makefile:121: cmTC_d1645/fast] Error 2
make[1]: Leaving directory '/home/vagrant/slave/monero-static-win64/build/build/release/CMakeFiles/CMakeTmp'


Determining if the function explicit_bzero exists in the c failed with the following output:
Change Dir: C:/msys64/home/vagrant/slave/monero-static-win64/build/build/release/CMakeFiles/CMakeTmp

Run Build Command:"C:/msys64/usr/bin/make.exe" "cmTC_b46ad/fast"
make[1]: Entering directory '/home/vagrant/slave/monero-static-win64/build/build/release/CMakeFiles/CMakeTmp'
/usr/bin/make -f CMakeFiles/cmTC_b46ad.dir/build.make CMakeFiles/cmTC_b46ad.dir/build
make[2]: Entering directory '/home/vagrant/slave/monero-static-win64/build/build/release/CMakeFiles/CMakeTmp'
Building C object CMakeFiles/cmTC_b46ad.dir/CheckFunctionExists.c.obj

/C/msys64/mingw64/bin/x86_64-w64-mingw32-gcc.exe   -DCHECK_FUNCTION_EXISTS=explicit_bzero   -o CMakeFiles/cmTC_b46ad.dir/CheckFunctionExists.c.obj   -c /C/msys64/mingw64/share/cmake-3.12/Modules/CheckFunctionExists.c
Linking C executable cmTC_b46ad.exe

/C/msys64/mingw64/bin/cmake.exe -E remove -f CMakeFiles/cmTC_b46ad.dir/objects.a
ar cr CMakeFiles/cmTC_b46ad.dir/objects.a "CMakeFiles/cmTC_b46ad.dir/CheckFunctionExists.c.obj" 
/C/msys64/mingw64/bin/x86_64-w64-mingw32-gcc.exe  -DCHECK_FUNCTION_EXISTS=explicit_bzero    -Wl,--whole-archive CMakeFiles/cmTC_b46ad.dir/objects.a -Wl,--no-whole-archive  -o cmTC_b46ad.exe -Wl,--major-image-version,0,--minor-image-version,0  -L/C/msys64/home/vagrant/slave/monero-static-win64/build/build/release/CMakeFiles/CMakeTmp/strings.h -lc -lkernel32 -luser32 -lgdi32 -lwinspool -lshell32 -lole32 -loleaut32 -luuid -lcomdlg32 -ladvapi32 
C:/msys64/mingw64/bin/../lib/gcc/x86_64-w64-mingw32/8.2.1/../../../../x86_64-w64-mingw32/bin/ld.exe: cannot find -lc

collect2.exe: error: ld returned 1 exit status
make[2]: *** [CMakeFiles/cmTC_b46ad.dir/build.make:88: cmTC_b46ad.exe] Error 1
make[2]: Leaving directory '/home/vagrant/slave/monero-static-win64/build/build/release/CMakeFiles/CMakeTmp'
make[1]: *** [Makefile:121: cmTC_b46ad/fast] Error 2
make[1]: Leaving directory '/home/vagrant/slave/monero-static-win64/build/build/release/CMakeFiles/CMakeTmp'


Determining if the function strptime exists failed with the following output:
Change Dir: C:/msys64/home/vagrant/slave/monero-static-win64/build/build/release/CMakeFiles/CMakeTmp

Run Build Command:"C:/msys64/usr/bin/make.exe" "cmTC_03b24/fast"
make[1]: Entering directory '/home/vagrant/slave/monero-static-win64/build/build/release/CMakeFiles/CMakeTmp'
/usr/bin/make -f CMakeFiles/cmTC_03b24.dir/build.make CMakeFiles/cmTC_03b24.dir/build
make[2]: Entering directory '/home/vagrant/slave/monero-static-win64/build/build/release/CMakeFiles/CMakeTmp'
Building C object CMakeFiles/cmTC_03b24.dir/CheckFunctionExists.c.obj

/C/msys64/mingw64/bin/x86_64-w64-mingw32-gcc.exe   -DCHECK_FUNCTION_EXISTS=strptime   -o CMakeFiles/cmTC_03b24.dir/CheckFunctionExists.c.obj   -c /C/msys64/mingw64/share/cmake-3.12/Modules/CheckFunctionExists.c
Linking C executable cmTC_03b24.exe

/C/msys64/mingw64/bin/cmake.exe -E remove -f CMakeFiles/cmTC_03b24.dir/objects.a
ar cr CMakeFiles/cmTC_03b24.dir/objects.a "CMakeFiles/cmTC_03b24.dir/CheckFunctionExists.c.obj" 
/C/msys64/mingw64/bin/x86_64-w64-mingw32-gcc.exe  -DCHECK_FUNCTION_EXISTS=strptime    -Wl,--whole-archive CMakeFiles/cmTC_03b24.dir/objects.a -Wl,--no-whole-archive  -o cmTC_03b24.exe -Wl,--major-image-version,0,--minor-image-version,0 -lkernel32 -luser32 -lgdi32 -lwinspool -lshell32 -lole32 -loleaut32 -luuid -lcomdlg32 -ladvapi32 
CMakeFiles/cmTC_03b24.dir/objects.a(CheckFunctionExists.c.obj):CheckFunctionExists.c:(.text+0x15): undefined reference to `strptime'

collect2.exe: error: ld returned 1 exit status
make[2]: *** [CMakeFiles/cmTC_03b24.dir/build.make:88: cmTC_03b24.exe] Error 1
make[2]: Leaving directory '/home/vagrant/slave/monero-static-win64/build/build/release/CMakeFiles/CMakeTmp'
make[1]: *** [Makefile:121: cmTC_03b24/fast] Error 2
make[1]: Leaving directory '/home/vagrant/slave/monero-static-win64/build/build/release/CMakeFiles/CMakeTmp'


Determining if the include file arpa/inet.h exists failed with the following output:
Change Dir: C:/msys64/home/vagrant/slave/monero-static-win64/build/build/release/CMakeFiles/CMakeTmp

Run Build Command:"C:/msys64/usr/bin/make.exe" "cmTC_14941/fast"
make[1]: Entering directory '/home/vagrant/slave/monero-static-win64/build/build/release/CMakeFiles/CMakeTmp'
/usr/bin/make -f CMakeFiles/cmTC_14941.dir/build.make CMakeFiles/cmTC_14941.dir/build
make[2]: Entering directory '/home/vagrant/slave/monero-static-win64/build/build/release/CMakeFiles/CMakeTmp'
Building C object CMakeFiles/cmTC_14941.dir/CheckIncludeFile.c.obj

/C/msys64/mingw64/bin/x86_64-w64-mingw32-gcc.exe    -o CMakeFiles/cmTC_14941.dir/CheckIncludeFile.c.obj   -c /C/msys64/home/vagrant/slave/monero-static-win64/build/build/release/CMakeFiles/CMakeTmp/CheckIncludeFile.c
C:/msys64/home/vagrant/slave/monero-static-win64/build/build/release/CMakeFiles/CMakeTmp/CheckIncludeFile.c:1:10: fatal error: arpa/inet.h: No such file or directory
 #include <arpa/inet.h>
          ^~~~~~~~~~~~~
compilation terminated.

make[2]: *** [CMakeFiles/cmTC_14941.dir/build.make:66: CMakeFiles/cmTC_14941.dir/CheckIncludeFile.c.obj] Error 1
make[2]: Leaving directory '/home/vagrant/slave/monero-static-win64/build/build/release/CMakeFiles/CMakeTmp'
make[1]: *** [Makefile:121: cmTC_14941/fast] Error 2
make[1]: Leaving directory '/home/vagrant/slave/monero-static-win64/build/build/release/CMakeFiles/CMakeTmp'


Determining if the include file endian.h exists failed with the following output:
Change Dir: C:/msys64/home/vagrant/slave/monero-static-win64/build/build/release/CMakeFiles/CMakeTmp

Run Build Command:"C:/msys64/usr/bin/make.exe" "cmTC_af065/fast"
make[1]: Entering directory '/home/vagrant/slave/monero-static-win64/build/build/release/CMakeFiles/CMakeTmp'
/usr/bin/make -f CMakeFiles/cmTC_af065.dir/build.make CMakeFiles/cmTC_af065.dir/build
make[2]: Entering directory '/home/vagrant/slave/monero-static-win64/build/build/release/CMakeFiles/CMakeTmp'
Building C object CMakeFiles/cmTC_af065.dir/CheckIncludeFile.c.obj

/C/msys64/mingw64/bin/x86_64-w64-mingw32-gcc.exe    -o CMakeFiles/cmTC_af065.dir/CheckIncludeFile.c.obj   -c /C/msys64/home/vagrant/slave/monero-static-win64/build/build/release/CMakeFiles/CMakeTmp/CheckIncludeFile.c
C:/msys64/home/vagrant/slave/monero-static-win64/build/build/release/CMakeFiles/CMakeTmp/CheckIncludeFile.c:1:10: fatal error: endian.h: No such file or directory
 #include <endian.h>
          ^~~~~~~~~~
compilation terminated.

make[2]: *** [CMakeFiles/cmTC_af065.dir/build.make:66: CMakeFiles/cmTC_af065.dir/CheckIncludeFile.c.obj] Error 1
make[2]: Leaving directory '/home/vagrant/slave/monero-static-win64/build/build/release/CMakeFiles/CMakeTmp'
make[1]: *** [Makefile:121: cmTC_af065/fast] Error 2
make[1]: Leaving directory '/home/vagrant/slave/monero-static-win64/build/build/release/CMakeFiles/CMakeTmp'


Determining if the include file dlfcn.h exists failed with the following output:
Change Dir: C:/msys64/home/vagrant/slave/monero-static-win64/build/build/release/CMakeFiles/CMakeTmp

Run Build Command:"C:/msys64/usr/bin/make.exe" "cmTC_57119/fast"
make[1]: Entering directory '/home/vagrant/slave/monero-static-win64/build/build/release/CMakeFiles/CMakeTmp'
/usr/bin/make -f CMakeFiles/cmTC_57119.dir/build.make CMakeFiles/cmTC_57119.dir/build
make[2]: Entering directory '/home/vagrant/slave/monero-static-win64/build/build/release/CMakeFiles/CMakeTmp'
Building C object CMakeFiles/cmTC_57119.dir/CheckIncludeFile.c.obj

/C/msys64/mingw64/bin/x86_64-w64-mingw32-gcc.exe    -o CMakeFiles/cmTC_57119.dir/CheckIncludeFile.c.obj   -c /C/msys64/home/vagrant/slave/monero-static-win64/build/build/release/CMakeFiles/CMakeTmp/CheckIncludeFile.c
C:/msys64/home/vagrant/slave/monero-static-win64/build/build/release/CMakeFiles/CMakeTmp/CheckIncludeFile.c:1:10: fatal error: dlfcn.h: No such file or directory
 #include <dlfcn.h>
          ^~~~~~~~~
compilation terminated.

make[2]: *** [CMakeFiles/cmTC_57119.dir/build.make:66: CMakeFiles/cmTC_57119.dir/CheckIncludeFile.c.obj] Error 1
make[2]: Leaving directory '/home/vagrant/slave/monero-static-win64/build/build/release/CMakeFiles/CMakeTmp'
make[1]: *** [Makefile:121: cmTC_57119/fast] Error 2
make[1]: Leaving directory '/home/vagrant/slave/monero-static-win64/build/build/release/CMakeFiles/CMakeTmp'


Determining if the include file event.h exists failed with the following output:
Change Dir: C:/msys64/home/vagrant/slave/monero-static-win64/build/build/release/CMakeFiles/CMakeTmp

Run Build Command:"C:/msys64/usr/bin/make.exe" "cmTC_93b26/fast"
make[1]: Entering directory '/home/vagrant/slave/monero-static-win64/build/build/release/CMakeFiles/CMakeTmp'
/usr/bin/make -f CMakeFiles/cmTC_93b26.dir/build.make CMakeFiles/cmTC_93b26.dir/build
make[2]: Entering directory '/home/vagrant/slave/monero-static-win64/build/build/release/CMakeFiles/CMakeTmp'
Building C object CMakeFiles/cmTC_93b26.dir/CheckIncludeFile.c.obj

/C/msys64/mingw64/bin/x86_64-w64-mingw32-gcc.exe    -o CMakeFiles/cmTC_93b26.dir/CheckIncludeFile.c.obj   -c /C/msys64/home/vagrant/slave/monero-static-win64/build/build/release/CMakeFiles/CMakeTmp/CheckIncludeFile.c
C:/msys64/home/vagrant/slave/monero-static-win64/build/build/release/CMakeFiles/CMakeTmp/CheckIncludeFile.c:1:10: fatal error: event.h: No such file or directory
 #include <event.h>
          ^~~~~~~~~
compilation terminated.

make[2]: *** [CMakeFiles/cmTC_93b26.dir/build.make:66: CMakeFiles/cmTC_93b26.dir/CheckIncludeFile.c.obj] Error 1
make[2]: Leaving directory '/home/vagrant/slave/monero-static-win64/build/build/release/CMakeFiles/CMakeTmp'
make[1]: *** [Makefile:121: cmTC_93b26/fast] Error 2
make[1]: Leaving directory '/home/vagrant/slave/monero-static-win64/build/build/release/CMakeFiles/CMakeTmp'


Determining if the include file glob.h exists failed with the following output:
Change Dir: C:/msys64/home/vagrant/slave/monero-static-win64/build/build/release/CMakeFiles/CMakeTmp

Run Build Command:"C:/msys64/usr/bin/make.exe" "cmTC_a3c16/fast"
make[1]: Entering directory '/home/vagrant/slave/monero-static-win64/build/build/release/CMakeFiles/CMakeTmp'
/usr/bin/make -f CMakeFiles/cmTC_a3c16.dir/build.make CMakeFiles/cmTC_a3c16.dir/build
make[2]: Entering directory '/home/vagrant/slave/monero-static-win64/build/build/release/CMakeFiles/CMakeTmp'
Building C object CMakeFiles/cmTC_a3c16.dir/CheckIncludeFile.c.obj

/C/msys64/mingw64/bin/x86_64-w64-mingw32-gcc.exe    -o CMakeFiles/cmTC_a3c16.dir/CheckIncludeFile.c.obj   -c /C/msys64/home/vagrant/slave/monero-static-win64/build/build/release/CMakeFiles/CMakeTmp/CheckIncludeFile.c
C:/msys64/home/vagrant/slave/monero-static-win64/build/build/release/CMakeFiles/CMakeTmp/CheckIncludeFile.c:1:10: fatal error: glob.h: No such file or directory
 #include <glob.h>
          ^~~~~~~~
compilation terminated.

make[2]: *** [CMakeFiles/cmTC_a3c16.dir/build.make:66: CMakeFiles/cmTC_a3c16.dir/CheckIncludeFile.c.obj] Error 1
make[2]: Leaving directory '/home/vagrant/slave/monero-static-win64/build/build/release/CMakeFiles/CMakeTmp'
make[1]: *** [Makefile:121: cmTC_a3c16/fast] Error 2
make[1]: Leaving directory '/home/vagrant/slave/monero-static-win64/build/build/release/CMakeFiles/CMakeTmp'


Determining if the include file grp.h exists failed with the following output:
Change Dir: C:/msys64/home/vagrant/slave/monero-static-win64/build/build/release/CMakeFiles/CMakeTmp

Run Build Command:"C:/msys64/usr/bin/make.exe" "cmTC_41690/fast"
make[1]: Entering directory '/home/vagrant/slave/monero-static-win64/build/build/release/CMakeFiles/CMakeTmp'
/usr/bin/make -f CMakeFiles/cmTC_41690.dir/build.make CMakeFiles/cmTC_41690.dir/build
make[2]: Entering directory '/home/vagrant/slave/monero-static-win64/build/build/release/CMakeFiles/CMakeTmp'
Building C object CMakeFiles/cmTC_41690.dir/CheckIncludeFile.c.obj

/C/msys64/mingw64/bin/x86_64-w64-mingw32-gcc.exe    -o CMakeFiles/cmTC_41690.dir/CheckIncludeFile.c.obj   -c /C/msys64/home/vagrant/slave/monero-static-win64/build/build/release/CMakeFiles/CMakeTmp/CheckIncludeFile.c
C:/msys64/home/vagrant/slave/monero-static-win64/build/build/release/CMakeFiles/CMakeTmp/CheckIncludeFile.c:1:10: fatal error: grp.h: No such file or directory
 #include <grp.h>
          ^~~~~~~
compilation terminated.

make[2]: *** [CMakeFiles/cmTC_41690.dir/build.make:66: CMakeFiles/cmTC_41690.dir/CheckIncludeFile.c.obj] Error 1
make[2]: Leaving directory '/home/vagrant/slave/monero-static-win64/build/build/release/CMakeFiles/CMakeTmp'
make[1]: *** [Makefile:121: cmTC_41690/fast] Error 2
make[1]: Leaving directory '/home/vagrant/slave/monero-static-win64/build/build/release/CMakeFiles/CMakeTmp'


Determining if the include file login_cap.h exists failed with the following output:
Change Dir: C:/msys64/home/vagrant/slave/monero-static-win64/build/build/release/CMakeFiles/CMakeTmp

Run Build Command:"C:/msys64/usr/bin/make.exe" "cmTC_9d044/fast"
make[1]: Entering directory '/home/vagrant/slave/monero-static-win64/build/build/release/CMakeFiles/CMakeTmp'
/usr/bin/make -f CMakeFiles/cmTC_9d044.dir/build.make CMakeFiles/cmTC_9d044.dir/build
make[2]: Entering directory '/home/vagrant/slave/monero-static-win64/build/build/release/CMakeFiles/CMakeTmp'
Building C object CMakeFiles/cmTC_9d044.dir/CheckIncludeFile.c.obj

/C/msys64/mingw64/bin/x86_64-w64-mingw32-gcc.exe    -o CMakeFiles/cmTC_9d044.dir/CheckIncludeFile.c.obj   -c /C/msys64/home/vagrant/slave/monero-static-win64/build/build/release/CMakeFiles/CMakeTmp/CheckIncludeFile.c
C:/msys64/home/vagrant/slave/monero-static-win64/build/build/release/CMakeFiles/CMakeTmp/CheckIncludeFile.c:1:10: fatal error: login_cap.h: No such file or directory
 #include <login_cap.h>
          ^~~~~~~~~~~~~
compilation terminated.

make[2]: *** [CMakeFiles/cmTC_9d044.dir/build.make:66: CMakeFiles/cmTC_9d044.dir/CheckIncludeFile.c.obj] Error 1
make[2]: Leaving directory '/home/vagrant/slave/monero-static-win64/build/build/release/CMakeFiles/CMakeTmp'
make[1]: *** [Makefile:121: cmTC_9d044/fast] Error 2
make[1]: Leaving directory '/home/vagrant/slave/monero-static-win64/build/build/release/CMakeFiles/CMakeTmp'


Determining if the include file netdb.h exists failed with the following output:
Change Dir: C:/msys64/home/vagrant/slave/monero-static-win64/build/build/release/CMakeFiles/CMakeTmp

Run Build Command:"C:/msys64/usr/bin/make.exe" "cmTC_611b3/fast"
make[1]: Entering directory '/home/vagrant/slave/monero-static-win64/build/build/release/CMakeFiles/CMakeTmp'
/usr/bin/make -f CMakeFiles/cmTC_611b3.dir/build.make CMakeFiles/cmTC_611b3.dir/build
make[2]: Entering directory '/home/vagrant/slave/monero-static-win64/build/build/release/CMakeFiles/CMakeTmp'
Building C object CMakeFiles/cmTC_611b3.dir/CheckIncludeFile.c.obj

/C/msys64/mingw64/bin/x86_64-w64-mingw32-gcc.exe    -o CMakeFiles/cmTC_611b3.dir/CheckIncludeFile.c.obj   -c /C/msys64/home/vagrant/slave/monero-static-win64/build/build/release/CMakeFiles/CMakeTmp/CheckIncludeFile.c
C:/msys64/home/vagrant/slave/monero-static-win64/build/build/release/CMakeFiles/CMakeTmp/CheckIncludeFile.c:1:10: fatal error: netdb.h: No such file or directory
 #include <netdb.h>
          ^~~~~~~~~
compilation terminated.

make[2]: *** [CMakeFiles/cmTC_611b3.dir/build.make:66: CMakeFiles/cmTC_611b3.dir/CheckIncludeFile.c.obj] Error 1
make[2]: Leaving directory '/home/vagrant/slave/monero-static-win64/build/build/release/CMakeFiles/CMakeTmp'
make[1]: *** [Makefile:121: cmTC_611b3/fast] Error 2
make[1]: Leaving directory '/home/vagrant/slave/monero-static-win64/build/build/release/CMakeFiles/CMakeTmp'


Determining if the include file netinet/in.h exists failed with the following output:
Change Dir: C:/msys64/home/vagrant/slave/monero-static-win64/build/build/release/CMakeFiles/CMakeTmp

Run Build Command:"C:/msys64/usr/bin/make.exe" "cmTC_9258a/fast"
make[1]: Entering directory '/home/vagrant/slave/monero-static-win64/build/build/release/CMakeFiles/CMakeTmp'
/usr/bin/make -f CMakeFiles/cmTC_9258a.dir/build.make CMakeFiles/cmTC_9258a.dir/build
make[2]: Entering directory '/home/vagrant/slave/monero-static-win64/build/build/release/CMakeFiles/CMakeTmp'
Building C object CMakeFiles/cmTC_9258a.dir/CheckIncludeFile.c.obj

/C/msys64/mingw64/bin/x86_64-w64-mingw32-gcc.exe    -o CMakeFiles/cmTC_9258a.dir/CheckIncludeFile.c.obj   -c /C/msys64/home/vagrant/slave/monero-static-win64/build/build/release/CMakeFiles/CMakeTmp/CheckIncludeFile.c
C:/msys64/home/vagrant/slave/monero-static-win64/build/build/release/CMakeFiles/CMakeTmp/CheckIncludeFile.c:1:10: fatal error: netinet/in.h: No such file or directory
 #include <netinet/in.h>
          ^~~~~~~~~~~~~~
compilation terminated.

make[2]: *** [CMakeFiles/cmTC_9258a.dir/build.make:66: CMakeFiles/cmTC_9258a.dir/CheckIncludeFile.c.obj] Error 1
make[2]: Leaving directory '/home/vagrant/slave/monero-static-win64/build/build/release/CMakeFiles/CMakeTmp'
make[1]: *** [Makefile:121: cmTC_9258a/fast] Error 2
make[1]: Leaving directory '/home/vagrant/slave/monero-static-win64/build/build/release/CMakeFiles/CMakeTmp'


Determining if the include file pwd.h exists failed with the following output:
Change Dir: C:/msys64/home/vagrant/slave/monero-static-win64/build/build/release/CMakeFiles/CMakeTmp

Run Build Command:"C:/msys64/usr/bin/make.exe" "cmTC_690dd/fast"
make[1]: Entering directory '/home/vagrant/slave/monero-static-win64/build/build/release/CMakeFiles/CMakeTmp'
/usr/bin/make -f CMakeFiles/cmTC_690dd.dir/build.make CMakeFiles/cmTC_690dd.dir/build
make[2]: Entering directory '/home/vagrant/slave/monero-static-win64/build/build/release/CMakeFiles/CMakeTmp'
Building C object CMakeFiles/cmTC_690dd.dir/CheckIncludeFile.c.obj

/C/msys64/mingw64/bin/x86_64-w64-mingw32-gcc.exe    -o CMakeFiles/cmTC_690dd.dir/CheckIncludeFile.c.obj   -c /C/msys64/home/vagrant/slave/monero-static-win64/build/build/release/CMakeFiles/CMakeTmp/CheckIncludeFile.c
C:/msys64/home/vagrant/slave/monero-static-win64/build/build/release/CMakeFiles/CMakeTmp/CheckIncludeFile.c:1:10: fatal error: pwd.h: No such file or directory
 #include <pwd.h>
          ^~~~~~~
compilation terminated.

make[2]: *** [CMakeFiles/cmTC_690dd.dir/build.make:66: CMakeFiles/cmTC_690dd.dir/CheckIncludeFile.c.obj] Error 1
make[2]: Leaving directory '/home/vagrant/slave/monero-static-win64/build/build/release/CMakeFiles/CMakeTmp'
make[1]: *** [Makefile:121: cmTC_690dd/fast] Error 2
make[1]: Leaving directory '/home/vagrant/slave/monero-static-win64/build/build/release/CMakeFiles/CMakeTmp'


Determining if the include file sys/resource.h exists failed with the following output:
Change Dir: C:/msys64/home/vagrant/slave/monero-static-win64/build/build/release/CMakeFiles/CMakeTmp

Run Build Command:"C:/msys64/usr/bin/make.exe" "cmTC_261ad/fast"
make[1]: Entering directory '/home/vagrant/slave/monero-static-win64/build/build/release/CMakeFiles/CMakeTmp'
/usr/bin/make -f CMakeFiles/cmTC_261ad.dir/build.make CMakeFiles/cmTC_261ad.dir/build
make[2]: Entering directory '/home/vagrant/slave/monero-static-win64/build/build/release/CMakeFiles/CMakeTmp'
Building C object CMakeFiles/cmTC_261ad.dir/CheckIncludeFile.c.obj

/C/msys64/mingw64/bin/x86_64-w64-mingw32-gcc.exe    -o CMakeFiles/cmTC_261ad.dir/CheckIncludeFile.c.obj   -c /C/msys64/home/vagrant/slave/monero-static-win64/build/build/release/CMakeFiles/CMakeTmp/CheckIncludeFile.c
C:/msys64/home/vagrant/slave/monero-static-win64/build/build/release/CMakeFiles/CMakeTmp/CheckIncludeFile.c:1:10: fatal error: sys/resource.h: No such file or directory
 #include <sys/resource.h>
          ^~~~~~~~~~~~~~~~
compilation terminated.

make[2]: *** [CMakeFiles/cmTC_261ad.dir/build.make:66: CMakeFiles/cmTC_261ad.dir/CheckIncludeFile.c.obj] Error 1
make[2]: Leaving directory '/home/vagrant/slave/monero-static-win64/build/build/release/CMakeFiles/CMakeTmp'
make[1]: *** [Makefile:121: cmTC_261ad/fast] Error 2
make[1]: Leaving directory '/home/vagrant/slave/monero-static-win64/build/build/release/CMakeFiles/CMakeTmp'


Determining if the include file sys/sha2.h exists failed with the following output:
Change Dir: C:/msys64/home/vagrant/slave/monero-static-win64/build/build/release/CMakeFiles/CMakeTmp

Run Build Command:"C:/msys64/usr/bin/make.exe" "cmTC_ba53b/fast"
make[1]: Entering directory '/home/vagrant/slave/monero-static-win64/build/build/release/CMakeFiles/CMakeTmp'
/usr/bin/make -f CMakeFiles/cmTC_ba53b.dir/build.make CMakeFiles/cmTC_ba53b.dir/build
make[2]: Entering directory '/home/vagrant/slave/monero-static-win64/build/build/release/CMakeFiles/CMakeTmp'
Building C object CMakeFiles/cmTC_ba53b.dir/CheckIncludeFile.c.obj

/C/msys64/mingw64/bin/x86_64-w64-mingw32-gcc.exe    -o CMakeFiles/cmTC_ba53b.dir/CheckIncludeFile.c.obj   -c /C/msys64/home/vagrant/slave/monero-static-win64/build/build/release/CMakeFiles/CMakeTmp/CheckIncludeFile.c
C:/msys64/home/vagrant/slave/monero-static-win64/build/build/release/CMakeFiles/CMakeTmp/CheckIncludeFile.c:1:10: fatal error: sys/sha2.h: No such file or directory
 #include <sys/sha2.h>
          ^~~~~~~~~~~~
compilation terminated.

make[2]: *** [CMakeFiles/cmTC_ba53b.dir/build.make:66: CMakeFiles/cmTC_ba53b.dir/CheckIncludeFile.c.obj] Error 1
make[2]: Leaving directory '/home/vagrant/slave/monero-static-win64/build/build/release/CMakeFiles/CMakeTmp'
make[1]: *** [Makefile:121: cmTC_ba53b/fast] Error 2
make[1]: Leaving directory '/home/vagrant/slave/monero-static-win64/build/build/release/CMakeFiles/CMakeTmp'


Determining if the include file sys/socket.h exists failed with the following output:
Change Dir: C:/msys64/home/vagrant/slave/monero-static-win64/build/build/release/CMakeFiles/CMakeTmp

Run Build Command:"C:/msys64/usr/bin/make.exe" "cmTC_cebca/fast"
make[1]: Entering directory '/home/vagrant/slave/monero-static-win64/build/build/release/CMakeFiles/CMakeTmp'
/usr/bin/make -f CMakeFiles/cmTC_cebca.dir/build.make CMakeFiles/cmTC_cebca.dir/build
make[2]: Entering directory '/home/vagrant/slave/monero-static-win64/build/build/release/CMakeFiles/CMakeTmp'
Building C object CMakeFiles/cmTC_cebca.dir/CheckIncludeFile.c.obj

/C/msys64/mingw64/bin/x86_64-w64-mingw32-gcc.exe    -o CMakeFiles/cmTC_cebca.dir/CheckIncludeFile.c.obj   -c /C/msys64/home/vagrant/slave/monero-static-win64/build/build/release/CMakeFiles/CMakeTmp/CheckIncludeFile.c
C:/msys64/home/vagrant/slave/monero-static-win64/build/build/release/CMakeFiles/CMakeTmp/CheckIncludeFile.c:1:10: fatal error: sys/socket.h: No such file or directory
 #include <sys/socket.h>
          ^~~~~~~~~~~~~~
compilation terminated.

make[2]: *** [CMakeFiles/cmTC_cebca.dir/build.make:66: CMakeFiles/cmTC_cebca.dir/CheckIncludeFile.c.obj] Error 1
make[2]: Leaving directory '/home/vagrant/slave/monero-static-win64/build/build/release/CMakeFiles/CMakeTmp'
make[1]: *** [Makefile:121: cmTC_cebca/fast] Error 2
make[1]: Leaving directory '/home/vagrant/slave/monero-static-win64/build/build/release/CMakeFiles/CMakeTmp'


Determining if the include file sys/sysctl.h exists failed with the following output:
Change Dir: C:/msys64/home/vagrant/slave/monero-static-win64/build/build/release/CMakeFiles/CMakeTmp

Run Build Command:"C:/msys64/usr/bin/make.exe" "cmTC_2b45d/fast"
make[1]: Entering directory '/home/vagrant/slave/monero-static-win64/build/build/release/CMakeFiles/CMakeTmp'
/usr/bin/make -f CMakeFiles/cmTC_2b45d.dir/build.make CMakeFiles/cmTC_2b45d.dir/build
make[2]: Entering directory '/home/vagrant/slave/monero-static-win64/build/build/release/CMakeFiles/CMakeTmp'
Building C object CMakeFiles/cmTC_2b45d.dir/CheckIncludeFile.c.obj

/C/msys64/mingw64/bin/x86_64-w64-mingw32-gcc.exe    -o CMakeFiles/cmTC_2b45d.dir/CheckIncludeFile.c.obj   -c /C/msys64/home/vagrant/slave/monero-static-win64/build/build/release/CMakeFiles/CMakeTmp/CheckIncludeFile.c
C:/msys64/home/vagrant/slave/monero-static-win64/build/build/release/CMakeFiles/CMakeTmp/CheckIncludeFile.c:1:10: fatal error: sys/sysctl.h: No such file or directory
 #include <sys/sysctl.h>
          ^~~~~~~~~~~~~~
compilation terminated.

make[2]: *** [CMakeFiles/cmTC_2b45d.dir/build.make:66: CMakeFiles/cmTC_2b45d.dir/CheckIncludeFile.c.obj] Error 1
make[2]: Leaving directory '/home/vagrant/slave/monero-static-win64/build/build/release/CMakeFiles/CMakeTmp'
make[1]: *** [Makefile:121: cmTC_2b45d/fast] Error 2
make[1]: Leaving directory '/home/vagrant/slave/monero-static-win64/build/build/release/CMakeFiles/CMakeTmp'


Determining if the include file sys/uio.h exists failed with the following output:
Change Dir: C:/msys64/home/vagrant/slave/monero-static-win64/build/build/release/CMakeFiles/CMakeTmp

Run Build Command:"C:/msys64/usr/bin/make.exe" "cmTC_2197c/fast"
make[1]: Entering directory '/home/vagrant/slave/monero-static-win64/build/build/release/CMakeFiles/CMakeTmp'
/usr/bin/make -f CMakeFiles/cmTC_2197c.dir/build.make CMakeFiles/cmTC_2197c.dir/build
make[2]: Entering directory '/home/vagrant/slave/monero-static-win64/build/build/release/CMakeFiles/CMakeTmp'
Building C object CMakeFiles/cmTC_2197c.dir/CheckIncludeFile.c.obj

/C/msys64/mingw64/bin/x86_64-w64-mingw32-gcc.exe    -o CMakeFiles/cmTC_2197c.dir/CheckIncludeFile.c.obj   -c /C/msys64/home/vagrant/slave/monero-static-win64/build/build/release/CMakeFiles/CMakeTmp/CheckIncludeFile.c
C:/msys64/home/vagrant/slave/monero-static-win64/build/build/release/CMakeFiles/CMakeTmp/CheckIncludeFile.c:1:10: fatal error: sys/uio.h: No such file or directory
 #include <sys/uio.h>
          ^~~~~~~~~~~
compilation terminated.

make[2]: *** [CMakeFiles/cmTC_2197c.dir/build.make:66: CMakeFiles/cmTC_2197c.dir/CheckIncludeFile.c.obj] Error 1
make[2]: Leaving directory '/home/vagrant/slave/monero-static-win64/build/build/release/CMakeFiles/CMakeTmp'
make[1]: *** [Makefile:121: cmTC_2197c/fast] Error 2
make[1]: Leaving directory '/home/vagrant/slave/monero-static-win64/build/build/release/CMakeFiles/CMakeTmp'


Determining if the include file sys/un.h exists failed with the following output:
Change Dir: C:/msys64/home/vagrant/slave/monero-static-win64/build/build/release/CMakeFiles/CMakeTmp

Run Build Command:"C:/msys64/usr/bin/make.exe" "cmTC_32eb2/fast"
make[1]: Entering directory '/home/vagrant/slave/monero-static-win64/build/build/release/CMakeFiles/CMakeTmp'
/usr/bin/make -f CMakeFiles/cmTC_32eb2.dir/build.make CMakeFiles/cmTC_32eb2.dir/build
make[2]: Entering directory '/home/vagrant/slave/monero-static-win64/build/build/release/CMakeFiles/CMakeTmp'
Building C object CMakeFiles/cmTC_32eb2.dir/CheckIncludeFile.c.obj

/C/msys64/mingw64/bin/x86_64-w64-mingw32-gcc.exe    -o CMakeFiles/cmTC_32eb2.dir/CheckIncludeFile.c.obj   -c /C/msys64/home/vagrant/slave/monero-static-win64/build/build/release/CMakeFiles/CMakeTmp/CheckIncludeFile.c
C:/msys64/home/vagrant/slave/monero-static-win64/build/build/release/CMakeFiles/CMakeTmp/CheckIncludeFile.c:1:10: fatal error: sys/un.h: No such file or directory
 #include <sys/un.h>
          ^~~~~~~~~~
compilation terminated.

make[2]: *** [CMakeFiles/cmTC_32eb2.dir/build.make:66: CMakeFiles/cmTC_32eb2.dir/CheckIncludeFile.c.obj] Error 1
make[2]: Leaving directory '/home/vagrant/slave/monero-static-win64/build/build/release/CMakeFiles/CMakeTmp'
make[1]: *** [Makefile:121: cmTC_32eb2/fast] Error 2
make[1]: Leaving directory '/home/vagrant/slave/monero-static-win64/build/build/release/CMakeFiles/CMakeTmp'


Determining if the include file sys/wait.h exists failed with the following output:
Change Dir: C:/msys64/home/vagrant/slave/monero-static-win64/build/build/release/CMakeFiles/CMakeTmp

Run Build Command:"C:/msys64/usr/bin/make.exe" "cmTC_9eb7d/fast"
make[1]: Entering directory '/home/vagrant/slave/monero-static-win64/build/build/release/CMakeFiles/CMakeTmp'
/usr/bin/make -f CMakeFiles/cmTC_9eb7d.dir/build.make CMakeFiles/cmTC_9eb7d.dir/build
make[2]: Entering directory '/home/vagrant/slave/monero-static-win64/build/build/release/CMakeFiles/CMakeTmp'
Building C object CMakeFiles/cmTC_9eb7d.dir/CheckIncludeFile.c.obj

/C/msys64/mingw64/bin/x86_64-w64-mingw32-gcc.exe    -o CMakeFiles/cmTC_9eb7d.dir/CheckIncludeFile.c.obj   -c /C/msys64/home/vagrant/slave/monero-static-win64/build/build/release/CMakeFiles/CMakeTmp/CheckIncludeFile.c
C:/msys64/home/vagrant/slave/monero-static-win64/build/build/release/CMakeFiles/CMakeTmp/CheckIncludeFile.c:1:10: fatal error: sys/wait.h: No such file or directory
 #include <sys/wait.h>
          ^~~~~~~~~~~~
compilation terminated.

make[2]: *** [CMakeFiles/cmTC_9eb7d.dir/build.make:66: CMakeFiles/cmTC_9eb7d.dir/CheckIncludeFile.c.obj] Error 1
make[2]: Leaving directory '/home/vagrant/slave/monero-static-win64/build/build/release/CMakeFiles/CMakeTmp'
make[1]: *** [Makefile:121: cmTC_9eb7d/fast] Error 2
make[1]: Leaving directory '/home/vagrant/slave/monero-static-win64/build/build/release/CMakeFiles/CMakeTmp'


Determining if the include file syslog.h exists failed with the following output:
Change Dir: C:/msys64/home/vagrant/slave/monero-static-win64/build/build/release/CMakeFiles/CMakeTmp

Run Build Command:"C:/msys64/usr/bin/make.exe" "cmTC_2cdc4/fast"
make[1]: Entering directory '/home/vagrant/slave/monero-static-win64/build/build/release/CMakeFiles/CMakeTmp'
/usr/bin/make -f CMakeFiles/cmTC_2cdc4.dir/build.make CMakeFiles/cmTC_2cdc4.dir/build
make[2]: Entering directory '/home/vagrant/slave/monero-static-win64/build/build/release/CMakeFiles/CMakeTmp'
Building C object CMakeFiles/cmTC_2cdc4.dir/CheckIncludeFile.c.obj

/C/msys64/mingw64/bin/x86_64-w64-mingw32-gcc.exe    -o CMakeFiles/cmTC_2cdc4.dir/CheckIncludeFile.c.obj   -c /C/msys64/home/vagrant/slave/monero-static-win64/build/build/release/CMakeFiles/CMakeTmp/CheckIncludeFile.c
C:/msys64/home/vagrant/slave/monero-static-win64/build/build/release/CMakeFiles/CMakeTmp/CheckIncludeFile.c:1:10: fatal error: syslog.h: No such file or directory
 #include <syslog.h>
          ^~~~~~~~~~
compilation terminated.

make[2]: *** [CMakeFiles/cmTC_2cdc4.dir/build.make:66: CMakeFiles/cmTC_2cdc4.dir/CheckIncludeFile.c.obj] Error 1
make[2]: Leaving directory '/home/vagrant/slave/monero-static-win64/build/build/release/CMakeFiles/CMakeTmp'
make[1]: *** [Makefile:121: cmTC_2cdc4/fast] Error 2
make[1]: Leaving directory '/home/vagrant/slave/monero-static-win64/build/build/release/CMakeFiles/CMakeTmp'


Determining if the include file vfork.h exists failed with the following output:
Change Dir: C:/msys64/home/vagrant/slave/monero-static-win64/build/build/release/CMakeFiles/CMakeTmp

Run Build Command:"C:/msys64/usr/bin/make.exe" "cmTC_49ec9/fast"
make[1]: Entering directory '/home/vagrant/slave/monero-static-win64/build/build/release/CMakeFiles/CMakeTmp'
/usr/bin/make -f CMakeFiles/cmTC_49ec9.dir/build.make CMakeFiles/cmTC_49ec9.dir/build
make[2]: Entering directory '/home/vagrant/slave/monero-static-win64/build/build/release/CMakeFiles/CMakeTmp'
Building C object CMakeFiles/cmTC_49ec9.dir/CheckIncludeFile.c.obj

/C/msys64/mingw64/bin/x86_64-w64-mingw32-gcc.exe    -o CMakeFiles/cmTC_49ec9.dir/CheckIncludeFile.c.obj   -c /C/msys64/home/vagrant/slave/monero-static-win64/build/build/release/CMakeFiles/CMakeTmp/CheckIncludeFile.c
C:/msys64/home/vagrant/slave/monero-static-win64/build/build/release/CMakeFiles/CMakeTmp/CheckIncludeFile.c:1:10: fatal error: vfork.h: No such file or directory
 #include <vfork.h>
          ^~~~~~~~~
compilation terminated.

make[2]: *** [CMakeFiles/cmTC_49ec9.dir/build.make:66: CMakeFiles/cmTC_49ec9.dir/CheckIncludeFile.c.obj] Error 1
make[2]: Leaving directory '/home/vagrant/slave/monero-static-win64/build/build/release/CMakeFiles/CMakeTmp'
make[1]: *** [Makefile:121: cmTC_49ec9/fast] Error 2
make[1]: Leaving directory '/home/vagrant/slave/monero-static-win64/build/build/release/CMakeFiles/CMakeTmp'


Determining if the function arc4random exists failed with the following output:
Change Dir: C:/msys64/home/vagrant/slave/monero-static-win64/build/build/release/CMakeFiles/CMakeTmp

Run Build Command:"C:/msys64/usr/bin/make.exe" "cmTC_4cf2d/fast"
make[1]: Entering directory '/home/vagrant/slave/monero-static-win64/build/build/release/CMakeFiles/CMakeTmp'
/usr/bin/make -f CMakeFiles/cmTC_4cf2d.dir/build.make CMakeFiles/cmTC_4cf2d.dir/build
make[2]: Entering directory '/home/vagrant/slave/monero-static-win64/build/build/release/CMakeFiles/CMakeTmp'
Building C object CMakeFiles/cmTC_4cf2d.dir/CheckFunctionExists.c.obj

/C/msys64/mingw64/bin/x86_64-w64-mingw32-gcc.exe   -DCHECK_FUNCTION_EXISTS=arc4random   -o CMakeFiles/cmTC_4cf2d.dir/CheckFunctionExists.c.obj   -c /C/msys64/mingw64/share/cmake-3.12/Modules/CheckFunctionExists.c
Linking C executable cmTC_4cf2d.exe

/C/msys64/mingw64/bin/cmake.exe -E remove -f CMakeFiles/cmTC_4cf2d.dir/objects.a
ar cr CMakeFiles/cmTC_4cf2d.dir/objects.a "CMakeFiles/cmTC_4cf2d.dir/CheckFunctionExists.c.obj" 
/C/msys64/mingw64/bin/x86_64-w64-mingw32-gcc.exe  -DCHECK_FUNCTION_EXISTS=arc4random    -Wl,--whole-archive CMakeFiles/cmTC_4cf2d.dir/objects.a -Wl,--no-whole-archive  -o cmTC_4cf2d.exe -Wl,--major-image-version,0,--minor-image-version,0 -liphlpapi -lws2_32 -lkernel32 -luser32 -lgdi32 -lwinspool -lshell32 -lole32 -loleaut32 -luuid -lcomdlg32 -ladvapi32 
CMakeFiles/cmTC_4cf2d.dir/objects.a(CheckFunctionExists.c.obj):CheckFunctionExists.c:(.text+0x15): undefined reference to `arc4random'

collect2.exe: error: ld returned 1 exit status
make[2]: *** [CMakeFiles/cmTC_4cf2d.dir/build.make:88: cmTC_4cf2d.exe] Error 1
make[2]: Leaving directory '/home/vagrant/slave/monero-static-win64/build/build/release/CMakeFiles/CMakeTmp'
make[1]: *** [Makefile:121: cmTC_4cf2d/fast] Error 2
make[1]: Leaving directory '/home/vagrant/slave/monero-static-win64/build/build/release/CMakeFiles/CMakeTmp'


Determining if the function arc4random_uniform exists failed with the following output:
Change Dir: C:/msys64/home/vagrant/slave/monero-static-win64/build/build/release/CMakeFiles/CMakeTmp

Run Build Command:"C:/msys64/usr/bin/make.exe" "cmTC_45a34/fast"
make[1]: Entering directory '/home/vagrant/slave/monero-static-win64/build/build/release/CMakeFiles/CMakeTmp'
/usr/bin/make -f CMakeFiles/cmTC_45a34.dir/build.make CMakeFiles/cmTC_45a34.dir/build
make[2]: Entering directory '/home/vagrant/slave/monero-static-win64/build/build/release/CMakeFiles/CMakeTmp'
Building C object CMakeFiles/cmTC_45a34.dir/CheckFunctionExists.c.obj

/C/msys64/mingw64/bin/x86_64-w64-mingw32-gcc.exe   -DCHECK_FUNCTION_EXISTS=arc4random_uniform   -o CMakeFiles/cmTC_45a34.dir/CheckFunctionExists.c.obj   -c /C/msys64/mingw64/share/cmake-3.12/Modules/CheckFunctionExists.c
Linking C executable cmTC_45a34.exe

/C/msys64/mingw64/bin/cmake.exe -E remove -f CMakeFiles/cmTC_45a34.dir/objects.a
ar cr CMakeFiles/cmTC_45a34.dir/objects.a "CMakeFiles/cmTC_45a34.dir/CheckFunctionExists.c.obj" 
/C/msys64/mingw64/bin/x86_64-w64-mingw32-gcc.exe  -DCHECK_FUNCTION_EXISTS=arc4random_uniform    -Wl,--whole-archive CMakeFiles/cmTC_45a34.dir/objects.a -Wl,--no-whole-archive  -o cmTC_45a34.exe -Wl,--major-image-version,0,--minor-image-version,0 -liphlpapi -lws2_32 -lkernel32 -luser32 -lgdi32 -lwinspool -lshell32 -lole32 -loleaut32 -luuid -lcomdlg32 -ladvapi32 
CMakeFiles/cmTC_45a34.dir/objects.a(CheckFunctionExists.c.obj):CheckFunctionExists.c:(.text+0x15): undefined reference to `arc4random_uniform'

collect2.exe: error: ld returned 1 exit status
make[2]: *** [CMakeFiles/cmTC_45a34.dir/build.make:88: cmTC_45a34.exe] Error 1
make[2]: Leaving directory '/home/vagrant/slave/monero-static-win64/build/build/release/CMakeFiles/CMakeTmp'
make[1]: *** [Makefile:121: cmTC_45a34/fast] Error 2
make[1]: Leaving directory '/home/vagrant/slave/monero-static-win64/build/build/release/CMakeFiles/CMakeTmp'


Determining if the function chown exists failed with the following output:
Change Dir: C:/msys64/home/vagrant/slave/monero-static-win64/build/build/release/CMakeFiles/CMakeTmp

Run Build Command:"C:/msys64/usr/bin/make.exe" "cmTC_7ed91/fast"
make[1]: Entering directory '/home/vagrant/slave/monero-static-win64/build/build/release/CMakeFiles/CMakeTmp'
/usr/bin/make -f CMakeFiles/cmTC_7ed91.dir/build.make CMakeFiles/cmTC_7ed91.dir/build
make[2]: Entering directory '/home/vagrant/slave/monero-static-win64/build/build/release/CMakeFiles/CMakeTmp'
Building C object CMakeFiles/cmTC_7ed91.dir/CheckFunctionExists.c.obj

/C/msys64/mingw64/bin/x86_64-w64-mingw32-gcc.exe   -DCHECK_FUNCTION_EXISTS=chown   -o CMakeFiles/cmTC_7ed91.dir/CheckFunctionExists.c.obj   -c /C/msys64/mingw64/share/cmake-3.12/Modules/CheckFunctionExists.c
Linking C executable cmTC_7ed91.exe

/C/msys64/mingw64/bin/cmake.exe -E remove -f CMakeFiles/cmTC_7ed91.dir/objects.a
ar cr CMakeFiles/cmTC_7ed91.dir/objects.a "CMakeFiles/cmTC_7ed91.dir/CheckFunctionExists.c.obj" 
/C/msys64/mingw64/bin/x86_64-w64-mingw32-gcc.exe  -DCHECK_FUNCTION_EXISTS=chown    -Wl,--whole-archive CMakeFiles/cmTC_7ed91.dir/objects.a -Wl,--no-whole-archive  -o cmTC_7ed91.exe -Wl,--major-image-version,0,--minor-image-version,0 -liphlpapi -lws2_32 -lkernel32 -luser32 -lgdi32 -lwinspool -lshell32 -lole32 -loleaut32 -luuid -lcomdlg32 -ladvapi32 
CMakeFiles/cmTC_7ed91.dir/objects.a(CheckFunctionExists.c.obj):CheckFunctionExists.c:(.text+0x15): undefined reference to `chown'

collect2.exe: error: ld returned 1 exit status
make[2]: *** [CMakeFiles/cmTC_7ed91.dir/build.make:88: cmTC_7ed91.exe] Error 1
make[2]: Leaving directory '/home/vagrant/slave/monero-static-win64/build/build/release/CMakeFiles/CMakeTmp'
make[1]: *** [Makefile:121: cmTC_7ed91/fast] Error 2
make[1]: Leaving directory '/home/vagrant/slave/monero-static-win64/build/build/release/CMakeFiles/CMakeTmp'


Determining if the function chroot exists failed with the following output:
Change Dir: C:/msys64/home/vagrant/slave/monero-static-win64/build/build/release/CMakeFiles/CMakeTmp

Run Build Command:"C:/msys64/usr/bin/make.exe" "cmTC_b0210/fast"
make[1]: Entering directory '/home/vagrant/slave/monero-static-win64/build/build/release/CMakeFiles/CMakeTmp'
/usr/bin/make -f CMakeFiles/cmTC_b0210.dir/build.make CMakeFiles/cmTC_b0210.dir/build
make[2]: Entering directory '/home/vagrant/slave/monero-static-win64/build/build/release/CMakeFiles/CMakeTmp'
Building C object CMakeFiles/cmTC_b0210.dir/CheckFunctionExists.c.obj

/C/msys64/mingw64/bin/x86_64-w64-mingw32-gcc.exe   -DCHECK_FUNCTION_EXISTS=chroot   -o CMakeFiles/cmTC_b0210.dir/CheckFunctionExists.c.obj   -c /C/msys64/mingw64/share/cmake-3.12/Modules/CheckFunctionExists.c
Linking C executable cmTC_b0210.exe

/C/msys64/mingw64/bin/cmake.exe -E remove -f CMakeFiles/cmTC_b0210.dir/objects.a
ar cr CMakeFiles/cmTC_b0210.dir/objects.a "CMakeFiles/cmTC_b0210.dir/CheckFunctionExists.c.obj" 
/C/msys64/mingw64/bin/x86_64-w64-mingw32-gcc.exe  -DCHECK_FUNCTION_EXISTS=chroot    -Wl,--whole-archive CMakeFiles/cmTC_b0210.dir/objects.a -Wl,--no-whole-archive  -o cmTC_b0210.exe -Wl,--major-image-version,0,--minor-image-version,0 -liphlpapi -lws2_32 -lkernel32 -luser32 -lgdi32 -lwinspool -lshell32 -lole32 -loleaut32 -luuid -lcomdlg32 -ladvapi32 
CMakeFiles/cmTC_b0210.dir/objects.a(CheckFunctionExists.c.obj):CheckFunctionExists.c:(.text+0x15): undefined reference to `chroot'

collect2.exe: error: ld returned 1 exit status
make[2]: *** [CMakeFiles/cmTC_b0210.dir/build.make:88: cmTC_b0210.exe] Error 1
make[2]: Leaving directory '/home/vagrant/slave/monero-static-win64/build/build/release/CMakeFiles/CMakeTmp'
make[1]: *** [Makefile:121: cmTC_b0210/fast] Error 2
make[1]: Leaving directory '/home/vagrant/slave/monero-static-win64/build/build/release/CMakeFiles/CMakeTmp'


Determining if the function ctime_r exists failed with the following output:
Change Dir: C:/msys64/home/vagrant/slave/monero-static-win64/build/build/release/CMakeFiles/CMakeTmp

Run Build Command:"C:/msys64/usr/bin/make.exe" "cmTC_9c3c0/fast"
make[1]: Entering directory '/home/vagrant/slave/monero-static-win64/build/build/release/CMakeFiles/CMakeTmp'
/usr/bin/make -f CMakeFiles/cmTC_9c3c0.dir/build.make CMakeFiles/cmTC_9c3c0.dir/build
make[2]: Entering directory '/home/vagrant/slave/monero-static-win64/build/build/release/CMakeFiles/CMakeTmp'
Building C object CMakeFiles/cmTC_9c3c0.dir/CheckFunctionExists.c.obj

/C/msys64/mingw64/bin/x86_64-w64-mingw32-gcc.exe   -DCHECK_FUNCTION_EXISTS=ctime_r   -o CMakeFiles/cmTC_9c3c0.dir/CheckFunctionExists.c.obj   -c /C/msys64/mingw64/share/cmake-3.12/Modules/CheckFunctionExists.c
Linking C executable cmTC_9c3c0.exe

/C/msys64/mingw64/bin/cmake.exe -E remove -f CMakeFiles/cmTC_9c3c0.dir/objects.a
ar cr CMakeFiles/cmTC_9c3c0.dir/objects.a "CMakeFiles/cmTC_9c3c0.dir/CheckFunctionExists.c.obj" 
/C/msys64/mingw64/bin/x86_64-w64-mingw32-gcc.exe  -DCHECK_FUNCTION_EXISTS=ctime_r    -Wl,--whole-archive CMakeFiles/cmTC_9c3c0.dir/objects.a -Wl,--no-whole-archive  -o cmTC_9c3c0.exe -Wl,--major-image-version,0,--minor-image-version,0 -liphlpapi -lws2_32 -lkernel32 -luser32 -lgdi32 -lwinspool -lshell32 -lole32 -loleaut32 -luuid -lcomdlg32 -ladvapi32 
CMakeFiles/cmTC_9c3c0.dir/objects.a(CheckFunctionExists.c.obj):CheckFunctionExists.c:(.text+0x15): undefined reference to `ctime_r'

collect2.exe: error: ld returned 1 exit status
make[2]: *** [CMakeFiles/cmTC_9c3c0.dir/build.make:88: cmTC_9c3c0.exe] Error 1
make[2]: Leaving directory '/home/vagrant/slave/monero-static-win64/build/build/release/CMakeFiles/CMakeTmp'
make[1]: *** [Makefile:121: cmTC_9c3c0/fast] Error 2
make[1]: Leaving directory '/home/vagrant/slave/monero-static-win64/build/build/release/CMakeFiles/CMakeTmp'


Determining if the function daemon exists failed with the following output:
Change Dir: C:/msys64/home/vagrant/slave/monero-static-win64/build/build/release/CMakeFiles/CMakeTmp

Run Build Command:"C:/msys64/usr/bin/make.exe" "cmTC_a174c/fast"
make[1]: Entering directory '/home/vagrant/slave/monero-static-win64/build/build/release/CMakeFiles/CMakeTmp'
/usr/bin/make -f CMakeFiles/cmTC_a174c.dir/build.make CMakeFiles/cmTC_a174c.dir/build
make[2]: Entering directory '/home/vagrant/slave/monero-static-win64/build/build/release/CMakeFiles/CMakeTmp'
Building C object CMakeFiles/cmTC_a174c.dir/CheckFunctionExists.c.obj

/C/msys64/mingw64/bin/x86_64-w64-mingw32-gcc.exe   -DCHECK_FUNCTION_EXISTS=daemon   -o CMakeFiles/cmTC_a174c.dir/CheckFunctionExists.c.obj   -c /C/msys64/mingw64/share/cmake-3.12/Modules/CheckFunctionExists.c
Linking C executable cmTC_a174c.exe

/C/msys64/mingw64/bin/cmake.exe -E remove -f CMakeFiles/cmTC_a174c.dir/objects.a
ar cr CMakeFiles/cmTC_a174c.dir/objects.a "CMakeFiles/cmTC_a174c.dir/CheckFunctionExists.c.obj" 
/C/msys64/mingw64/bin/x86_64-w64-mingw32-gcc.exe  -DCHECK_FUNCTION_EXISTS=daemon    -Wl,--whole-archive CMakeFiles/cmTC_a174c.dir/objects.a -Wl,--no-whole-archive  -o cmTC_a174c.exe -Wl,--major-image-version,0,--minor-image-version,0 -liphlpapi -lws2_32 -lkernel32 -luser32 -lgdi32 -lwinspool -lshell32 -lole32 -loleaut32 -luuid -lcomdlg32 -ladvapi32 
CMakeFiles/cmTC_a174c.dir/objects.a(CheckFunctionExists.c.obj):CheckFunctionExists.c:(.text+0x15): undefined reference to `daemon'

collect2.exe: error: ld returned 1 exit status
make[2]: *** [CMakeFiles/cmTC_a174c.dir/build.make:88: cmTC_a174c.exe] Error 1
make[2]: Leaving directory '/home/vagrant/slave/monero-static-win64/build/build/release/CMakeFiles/CMakeTmp'
make[1]: *** [Makefile:121: cmTC_a174c/fast] Error 2
make[1]: Leaving directory '/home/vagrant/slave/monero-static-win64/build/build/release/CMakeFiles/CMakeTmp'


Determining if the function endprotoent exists failed with the following output:
Change Dir: C:/msys64/home/vagrant/slave/monero-static-win64/build/build/release/CMakeFiles/CMakeTmp

Run Build Command:"C:/msys64/usr/bin/make.exe" "cmTC_a3b3f/fast"
make[1]: Entering directory '/home/vagrant/slave/monero-static-win64/build/build/release/CMakeFiles/CMakeTmp'
/usr/bin/make -f CMakeFiles/cmTC_a3b3f.dir/build.make CMakeFiles/cmTC_a3b3f.dir/build
make[2]: Entering directory '/home/vagrant/slave/monero-static-win64/build/build/release/CMakeFiles/CMakeTmp'
Building C object CMakeFiles/cmTC_a3b3f.dir/CheckFunctionExists.c.obj

/C/msys64/mingw64/bin/x86_64-w64-mingw32-gcc.exe   -DCHECK_FUNCTION_EXISTS=endprotoent   -o CMakeFiles/cmTC_a3b3f.dir/CheckFunctionExists.c.obj   -c /C/msys64/mingw64/share/cmake-3.12/Modules/CheckFunctionExists.c
Linking C executable cmTC_a3b3f.exe

/C/msys64/mingw64/bin/cmake.exe -E remove -f CMakeFiles/cmTC_a3b3f.dir/objects.a
ar cr CMakeFiles/cmTC_a3b3f.dir/objects.a "CMakeFiles/cmTC_a3b3f.dir/CheckFunctionExists.c.obj" 
/C/msys64/mingw64/bin/x86_64-w64-mingw32-gcc.exe  -DCHECK_FUNCTION_EXISTS=endprotoent    -Wl,--whole-archive CMakeFiles/cmTC_a3b3f.dir/objects.a -Wl,--no-whole-archive  -o cmTC_a3b3f.exe -Wl,--major-image-version,0,--minor-image-version,0 -liphlpapi -lws2_32 -lkernel32 -luser32 -lgdi32 -lwinspool -lshell32 -lole32 -loleaut32 -luuid -lcomdlg32 -ladvapi32 
CMakeFiles/cmTC_a3b3f.dir/objects.a(CheckFunctionExists.c.obj):CheckFunctionExists.c:(.text+0x15): undefined reference to `endprotoent'

collect2.exe: error: ld returned 1 exit status
make[2]: *** [CMakeFiles/cmTC_a3b3f.dir/build.make:88: cmTC_a3b3f.exe] Error 1
make[2]: Leaving directory '/home/vagrant/slave/monero-static-win64/build/build/release/CMakeFiles/CMakeTmp'
make[1]: *** [Makefile:121: cmTC_a3b3f/fast] Error 2
make[1]: Leaving directory '/home/vagrant/slave/monero-static-win64/build/build/release/CMakeFiles/CMakeTmp'


Determining if the function endservent exists failed with the following output:
Change Dir: C:/msys64/home/vagrant/slave/monero-static-win64/build/build/release/CMakeFiles/CMakeTmp

Run Build Command:"C:/msys64/usr/bin/make.exe" "cmTC_f642d/fast"
make[1]: Entering directory '/home/vagrant/slave/monero-static-win64/build/build/release/CMakeFiles/CMakeTmp'
/usr/bin/make -f CMakeFiles/cmTC_f642d.dir/build.make CMakeFiles/cmTC_f642d.dir/build
make[2]: Entering directory '/home/vagrant/slave/monero-static-win64/build/build/release/CMakeFiles/CMakeTmp'
Building C object CMakeFiles/cmTC_f642d.dir/CheckFunctionExists.c.obj

/C/msys64/mingw64/bin/x86_64-w64-mingw32-gcc.exe   -DCHECK_FUNCTION_EXISTS=endservent   -o CMakeFiles/cmTC_f642d.dir/CheckFunctionExists.c.obj   -c /C/msys64/mingw64/share/cmake-3.12/Modules/CheckFunctionExists.c
Linking C executable cmTC_f642d.exe

/C/msys64/mingw64/bin/cmake.exe -E remove -f CMakeFiles/cmTC_f642d.dir/objects.a
ar cr CMakeFiles/cmTC_f642d.dir/objects.a "CMakeFiles/cmTC_f642d.dir/CheckFunctionExists.c.obj" 
/C/msys64/mingw64/bin/x86_64-w64-mingw32-gcc.exe  -DCHECK_FUNCTION_EXISTS=endservent    -Wl,--whole-archive CMakeFiles/cmTC_f642d.dir/objects.a -Wl,--no-whole-archive  -o cmTC_f642d.exe -Wl,--major-image-version,0,--minor-image-version,0 -liphlpapi -lws2_32 -lkernel32 -luser32 -lgdi32 -lwinspool -lshell32 -lole32 -loleaut32 -luuid -lcomdlg32 -ladvapi32 
CMakeFiles/cmTC_f642d.dir/objects.a(CheckFunctionExists.c.obj):CheckFunctionExists.c:(.text+0x15): undefined reference to `endservent'

collect2.exe: error: ld returned 1 exit status
make[2]: *** [CMakeFiles/cmTC_f642d.dir/build.make:88: cmTC_f642d.exe] Error 1
make[2]: Leaving directory '/home/vagrant/slave/monero-static-win64/build/build/release/CMakeFiles/CMakeTmp'
make[1]: *** [Makefile:121: cmTC_f642d/fast] Error 2
make[1]: Leaving directory '/home/vagrant/slave/monero-static-win64/build/build/release/CMakeFiles/CMakeTmp'


Determining if the function fork exists failed with the following output:
Change Dir: C:/msys64/home/vagrant/slave/monero-static-win64/build/build/release/CMakeFiles/CMakeTmp

Run Build Command:"C:/msys64/usr/bin/make.exe" "cmTC_2f5ed/fast"
make[1]: Entering directory '/home/vagrant/slave/monero-static-win64/build/build/release/CMakeFiles/CMakeTmp'
/usr/bin/make -f CMakeFiles/cmTC_2f5ed.dir/build.make CMakeFiles/cmTC_2f5ed.dir/build
make[2]: Entering directory '/home/vagrant/slave/monero-static-win64/build/build/release/CMakeFiles/CMakeTmp'
Building C object CMakeFiles/cmTC_2f5ed.dir/CheckFunctionExists.c.obj

/C/msys64/mingw64/bin/x86_64-w64-mingw32-gcc.exe   -DCHECK_FUNCTION_EXISTS=fork   -o CMakeFiles/cmTC_2f5ed.dir/CheckFunctionExists.c.obj   -c /C/msys64/mingw64/share/cmake-3.12/Modules/CheckFunctionExists.c
<command-line>: warning: conflicting types for built-in function 'fork' [-Wbuiltin-declaration-mismatch]
C:/msys64/mingw64/share/cmake-3.12/Modules/CheckFunctionExists.c:7:3: note: in expansion of macro 'CHECK_FUNCTION_EXISTS'
   CHECK_FUNCTION_EXISTS(void);
   ^~~~~~~~~~~~~~~~~~~~~
Linking C executable cmTC_2f5ed.exe

/C/msys64/mingw64/bin/cmake.exe -E remove -f CMakeFiles/cmTC_2f5ed.dir/objects.a
ar cr CMakeFiles/cmTC_2f5ed.dir/objects.a "CMakeFiles/cmTC_2f5ed.dir/CheckFunctionExists.c.obj" 
/C/msys64/mingw64/bin/x86_64-w64-mingw32-gcc.exe  -DCHECK_FUNCTION_EXISTS=fork    -Wl,--whole-archive CMakeFiles/cmTC_2f5ed.dir/objects.a -Wl,--no-whole-archive  -o cmTC_2f5ed.exe -Wl,--major-image-version,0,--minor-image-version,0 -liphlpapi -lws2_32 -lkernel32 -luser32 -lgdi32 -lwinspool -lshell32 -lole32 -loleaut32 -luuid -lcomdlg32 -ladvapi32 
CMakeFiles/cmTC_2f5ed.dir/objects.a(CheckFunctionExists.c.obj):CheckFunctionExists.c:(.text+0x15): undefined reference to `fork'

collect2.exe: error: ld returned 1 exit status
make[2]: *** [CMakeFiles/cmTC_2f5ed.dir/build.make:88: cmTC_2f5ed.exe] Error 1
make[2]: Leaving directory '/home/vagrant/slave/monero-static-win64/build/build/release/CMakeFiles/CMakeTmp'
make[1]: *** [Makefile:121: cmTC_2f5ed/fast] Error 2
make[1]: Leaving directory '/home/vagrant/slave/monero-static-win64/build/build/release/CMakeFiles/CMakeTmp'


Determining if the function fsync exists failed with the following output:
Change Dir: C:/msys64/home/vagrant/slave/monero-static-win64/build/build/release/CMakeFiles/CMakeTmp

Run Build Command:"C:/msys64/usr/bin/make.exe" "cmTC_8b135/fast"
make[1]: Entering directory '/home/vagrant/slave/monero-static-win64/build/build/release/CMakeFiles/CMakeTmp'
/usr/bin/make -f CMakeFiles/cmTC_8b135.dir/build.make CMakeFiles/cmTC_8b135.dir/build
make[2]: Entering directory '/home/vagrant/slave/monero-static-win64/build/build/release/CMakeFiles/CMakeTmp'
Building C object CMakeFiles/cmTC_8b135.dir/CheckFunctionExists.c.obj

/C/msys64/mingw64/bin/x86_64-w64-mingw32-gcc.exe   -DCHECK_FUNCTION_EXISTS=fsync   -o CMakeFiles/cmTC_8b135.dir/CheckFunctionExists.c.obj   -c /C/msys64/mingw64/share/cmake-3.12/Modules/CheckFunctionExists.c
Linking C executable cmTC_8b135.exe

/C/msys64/mingw64/bin/cmake.exe -E remove -f CMakeFiles/cmTC_8b135.dir/objects.a
ar cr CMakeFiles/cmTC_8b135.dir/objects.a "CMakeFiles/cmTC_8b135.dir/CheckFunctionExists.c.obj" 
/C/msys64/mingw64/bin/x86_64-w64-mingw32-gcc.exe  -DCHECK_FUNCTION_EXISTS=fsync    -Wl,--whole-archive CMakeFiles/cmTC_8b135.dir/objects.a -Wl,--no-whole-archive  -o cmTC_8b135.exe -Wl,--major-image-version,0,--minor-image-version,0 -liphlpapi -lws2_32 -lkernel32 -luser32 -lgdi32 -lwinspool -lshell32 -lole32 -loleaut32 -luuid -lcomdlg32 -ladvapi32 
CMakeFiles/cmTC_8b135.dir/objects.a(CheckFunctionExists.c.obj):CheckFunctionExists.c:(.text+0x15): undefined reference to `fsync'

collect2.exe: error: ld returned 1 exit status
make[2]: *** [CMakeFiles/cmTC_8b135.dir/build.make:88: cmTC_8b135.exe] Error 1
make[2]: Leaving directory '/home/vagrant/slave/monero-static-win64/build/build/release/CMakeFiles/CMakeTmp'
make[1]: *** [Makefile:121: cmTC_8b135/fast] Error 2
make[1]: Leaving directory '/home/vagrant/slave/monero-static-win64/build/build/release/CMakeFiles/CMakeTmp'


Determining if the function getauxval exists failed with the following output:
Change Dir: C:/msys64/home/vagrant/slave/monero-static-win64/build/build/release/CMakeFiles/CMakeTmp

Run Build Command:"C:/msys64/usr/bin/make.exe" "cmTC_7e383/fast"
make[1]: Entering directory '/home/vagrant/slave/monero-static-win64/build/build/release/CMakeFiles/CMakeTmp'
/usr/bin/make -f CMakeFiles/cmTC_7e383.dir/build.make CMakeFiles/cmTC_7e383.dir/build
make[2]: Entering directory '/home/vagrant/slave/monero-static-win64/build/build/release/CMakeFiles/CMakeTmp'
Building C object CMakeFiles/cmTC_7e383.dir/CheckFunctionExists.c.obj

/C/msys64/mingw64/bin/x86_64-w64-mingw32-gcc.exe   -DCHECK_FUNCTION_EXISTS=getauxval   -o CMakeFiles/cmTC_7e383.dir/CheckFunctionExists.c.obj   -c /C/msys64/mingw64/share/cmake-3.12/Modules/CheckFunctionExists.c
Linking C executable cmTC_7e383.exe

/C/msys64/mingw64/bin/cmake.exe -E remove -f CMakeFiles/cmTC_7e383.dir/objects.a
ar cr CMakeFiles/cmTC_7e383.dir/objects.a "CMakeFiles/cmTC_7e383.dir/CheckFunctionExists.c.obj" 
/C/msys64/mingw64/bin/x86_64-w64-mingw32-gcc.exe  -DCHECK_FUNCTION_EXISTS=getauxval    -Wl,--whole-archive CMakeFiles/cmTC_7e383.dir/objects.a -Wl,--no-whole-archive  -o cmTC_7e383.exe -Wl,--major-image-version,0,--minor-image-version,0 -liphlpapi -lws2_32 -lkernel32 -luser32 -lgdi32 -lwinspool -lshell32 -lole32 -loleaut32 -luuid -lcomdlg32 -ladvapi32 
CMakeFiles/cmTC_7e383.dir/objects.a(CheckFunctionExists.c.obj):CheckFunctionExists.c:(.text+0x15): undefined reference to `getauxval'

collect2.exe: error: ld returned 1 exit status
make[2]: *** [CMakeFiles/cmTC_7e383.dir/build.make:88: cmTC_7e383.exe] Error 1
make[2]: Leaving directory '/home/vagrant/slave/monero-static-win64/build/build/release/CMakeFiles/CMakeTmp'
make[1]: *** [Makefile:121: cmTC_7e383/fast] Error 2
make[1]: Leaving directory '/home/vagrant/slave/monero-static-win64/build/build/release/CMakeFiles/CMakeTmp'


Determining if the function getentropy exists failed with the following output:
Change Dir: C:/msys64/home/vagrant/slave/monero-static-win64/build/build/release/CMakeFiles/CMakeTmp

Run Build Command:"C:/msys64/usr/bin/make.exe" "cmTC_9c24b/fast"
make[1]: Entering directory '/home/vagrant/slave/monero-static-win64/build/build/release/CMakeFiles/CMakeTmp'
/usr/bin/make -f CMakeFiles/cmTC_9c24b.dir/build.make CMakeFiles/cmTC_9c24b.dir/build
make[2]: Entering directory '/home/vagrant/slave/monero-static-win64/build/build/release/CMakeFiles/CMakeTmp'
Building C object CMakeFiles/cmTC_9c24b.dir/CheckFunctionExists.c.obj

/C/msys64/mingw64/bin/x86_64-w64-mingw32-gcc.exe   -DCHECK_FUNCTION_EXISTS=getentropy   -o CMakeFiles/cmTC_9c24b.dir/CheckFunctionExists.c.obj   -c /C/msys64/mingw64/share/cmake-3.12/Modules/CheckFunctionExists.c
Linking C executable cmTC_9c24b.exe

/C/msys64/mingw64/bin/cmake.exe -E remove -f CMakeFiles/cmTC_9c24b.dir/objects.a
ar cr CMakeFiles/cmTC_9c24b.dir/objects.a "CMakeFiles/cmTC_9c24b.dir/CheckFunctionExists.c.obj" 
/C/msys64/mingw64/bin/x86_64-w64-mingw32-gcc.exe  -DCHECK_FUNCTION_EXISTS=getentropy    -Wl,--whole-archive CMakeFiles/cmTC_9c24b.dir/objects.a -Wl,--no-whole-archive  -o cmTC_9c24b.exe -Wl,--major-image-version,0,--minor-image-version,0 -liphlpapi -lws2_32 -lkernel32 -luser32 -lgdi32 -lwinspool -lshell32 -lole32 -loleaut32 -luuid -lcomdlg32 -ladvapi32 
CMakeFiles/cmTC_9c24b.dir/objects.a(CheckFunctionExists.c.obj):CheckFunctionExists.c:(.text+0x15): undefined reference to `getentropy'

collect2.exe: error: ld returned 1 exit status
make[2]: *** [CMakeFiles/cmTC_9c24b.dir/build.make:88: cmTC_9c24b.exe] Error 1
make[2]: Leaving directory '/home/vagrant/slave/monero-static-win64/build/build/release/CMakeFiles/CMakeTmp'
make[1]: *** [Makefile:121: cmTC_9c24b/fast] Error 2
make[1]: Leaving directory '/home/vagrant/slave/monero-static-win64/build/build/release/CMakeFiles/CMakeTmp'


Determining if the function getpwnam exists failed with the following output:
Change Dir: C:/msys64/home/vagrant/slave/monero-static-win64/build/build/release/CMakeFiles/CMakeTmp

Run Build Command:"C:/msys64/usr/bin/make.exe" "cmTC_bcff7/fast"
make[1]: Entering directory '/home/vagrant/slave/monero-static-win64/build/build/release/CMakeFiles/CMakeTmp'
/usr/bin/make -f CMakeFiles/cmTC_bcff7.dir/build.make CMakeFiles/cmTC_bcff7.dir/build
make[2]: Entering directory '/home/vagrant/slave/monero-static-win64/build/build/release/CMakeFiles/CMakeTmp'
Building C object CMakeFiles/cmTC_bcff7.dir/CheckFunctionExists.c.obj

/C/msys64/mingw64/bin/x86_64-w64-mingw32-gcc.exe   -DCHECK_FUNCTION_EXISTS=getpwnam   -o CMakeFiles/cmTC_bcff7.dir/CheckFunctionExists.c.obj   -c /C/msys64/mingw64/share/cmake-3.12/Modules/CheckFunctionExists.c
Linking C executable cmTC_bcff7.exe

/C/msys64/mingw64/bin/cmake.exe -E remove -f CMakeFiles/cmTC_bcff7.dir/objects.a
ar cr CMakeFiles/cmTC_bcff7.dir/objects.a "CMakeFiles/cmTC_bcff7.dir/CheckFunctionExists.c.obj" 
/C/msys64/mingw64/bin/x86_64-w64-mingw32-gcc.exe  -DCHECK_FUNCTION_EXISTS=getpwnam    -Wl,--whole-archive CMakeFiles/cmTC_bcff7.dir/objects.a -Wl,--no-whole-archive  -o cmTC_bcff7.exe -Wl,--major-image-version,0,--minor-image-version,0 -liphlpapi -lws2_32 -lkernel32 -luser32 -lgdi32 -lwinspool -lshell32 -lole32 -loleaut32 -luuid -lcomdlg32 -ladvapi32 
CMakeFiles/cmTC_bcff7.dir/objects.a(CheckFunctionExists.c.obj):CheckFunctionExists.c:(.text+0x15): undefined reference to `getpwnam'

collect2.exe: error: ld returned 1 exit status
make[2]: *** [CMakeFiles/cmTC_bcff7.dir/build.make:88: cmTC_bcff7.exe] Error 1
make[2]: Leaving directory '/home/vagrant/slave/monero-static-win64/build/build/release/CMakeFiles/CMakeTmp'
make[1]: *** [Makefile:121: cmTC_bcff7/fast] Error 2
make[1]: Leaving directory '/home/vagrant/slave/monero-static-win64/build/build/release/CMakeFiles/CMakeTmp'


Determining if the function getrlimit exists failed with the following output:
Change Dir: C:/msys64/home/vagrant/slave/monero-static-win64/build/build/release/CMakeFiles/CMakeTmp

Run Build Command:"C:/msys64/usr/bin/make.exe" "cmTC_71cbc/fast"
make[1]: Entering directory '/home/vagrant/slave/monero-static-win64/build/build/release/CMakeFiles/CMakeTmp'
/usr/bin/make -f CMakeFiles/cmTC_71cbc.dir/build.make CMakeFiles/cmTC_71cbc.dir/build
make[2]: Entering directory '/home/vagrant/slave/monero-static-win64/build/build/release/CMakeFiles/CMakeTmp'
Building C object CMakeFiles/cmTC_71cbc.dir/CheckFunctionExists.c.obj

/C/msys64/mingw64/bin/x86_64-w64-mingw32-gcc.exe   -DCHECK_FUNCTION_EXISTS=getrlimit   -o CMakeFiles/cmTC_71cbc.dir/CheckFunctionExists.c.obj   -c /C/msys64/mingw64/share/cmake-3.12/Modules/CheckFunctionExists.c
Linking C executable cmTC_71cbc.exe

/C/msys64/mingw64/bin/cmake.exe -E remove -f CMakeFiles/cmTC_71cbc.dir/objects.a
ar cr CMakeFiles/cmTC_71cbc.dir/objects.a "CMakeFiles/cmTC_71cbc.dir/CheckFunctionExists.c.obj" 
/C/msys64/mingw64/bin/x86_64-w64-mingw32-gcc.exe  -DCHECK_FUNCTION_EXISTS=getrlimit    -Wl,--whole-archive CMakeFiles/cmTC_71cbc.dir/objects.a -Wl,--no-whole-archive  -o cmTC_71cbc.exe -Wl,--major-image-version,0,--minor-image-version,0 -liphlpapi -lws2_32 -lkernel32 -luser32 -lgdi32 -lwinspool -lshell32 -lole32 -loleaut32 -luuid -lcomdlg32 -ladvapi32 
CMakeFiles/cmTC_71cbc.dir/objects.a(CheckFunctionExists.c.obj):CheckFunctionExists.c:(.text+0x15): undefined reference to `getrlimit'

collect2.exe: error: ld returned 1 exit status
make[2]: *** [CMakeFiles/cmTC_71cbc.dir/build.make:88: cmTC_71cbc.exe] Error 1
make[2]: Leaving directory '/home/vagrant/slave/monero-static-win64/build/build/release/CMakeFiles/CMakeTmp'
make[1]: *** [Makefile:121: cmTC_71cbc/fast] Error 2
make[1]: Leaving directory '/home/vagrant/slave/monero-static-win64/build/build/release/CMakeFiles/CMakeTmp'


Determining if the function glob exists failed with the following output:
Change Dir: C:/msys64/home/vagrant/slave/monero-static-win64/build/build/release/CMakeFiles/CMakeTmp

Run Build Command:"C:/msys64/usr/bin/make.exe" "cmTC_d9824/fast"
make[1]: Entering directory '/home/vagrant/slave/monero-static-win64/build/build/release/CMakeFiles/CMakeTmp'
/usr/bin/make -f CMakeFiles/cmTC_d9824.dir/build.make CMakeFiles/cmTC_d9824.dir/build
make[2]: Entering directory '/home/vagrant/slave/monero-static-win64/build/build/release/CMakeFiles/CMakeTmp'
Building C object CMakeFiles/cmTC_d9824.dir/CheckFunctionExists.c.obj

/C/msys64/mingw64/bin/x86_64-w64-mingw32-gcc.exe   -DCHECK_FUNCTION_EXISTS=glob   -o CMakeFiles/cmTC_d9824.dir/CheckFunctionExists.c.obj   -c /C/msys64/mingw64/share/cmake-3.12/Modules/CheckFunctionExists.c
Linking C executable cmTC_d9824.exe

/C/msys64/mingw64/bin/cmake.exe -E remove -f CMakeFiles/cmTC_d9824.dir/objects.a
ar cr CMakeFiles/cmTC_d9824.dir/objects.a "CMakeFiles/cmTC_d9824.dir/CheckFunctionExists.c.obj" 
/C/msys64/mingw64/bin/x86_64-w64-mingw32-gcc.exe  -DCHECK_FUNCTION_EXISTS=glob    -Wl,--whole-archive CMakeFiles/cmTC_d9824.dir/objects.a -Wl,--no-whole-archive  -o cmTC_d9824.exe -Wl,--major-image-version,0,--minor-image-version,0 -liphlpapi -lws2_32 -lkernel32 -luser32 -lgdi32 -lwinspool -lshell32 -lole32 -loleaut32 -luuid -lcomdlg32 -ladvapi32 
CMakeFiles/cmTC_d9824.dir/objects.a(CheckFunctionExists.c.obj):CheckFunctionExists.c:(.text+0x15): undefined reference to `glob'

collect2.exe: error: ld returned 1 exit status
make[2]: *** [CMakeFiles/cmTC_d9824.dir/build.make:88: cmTC_d9824.exe] Error 1
make[2]: Leaving directory '/home/vagrant/slave/monero-static-win64/build/build/release/CMakeFiles/CMakeTmp'
make[1]: *** [Makefile:121: cmTC_d9824/fast] Error 2
make[1]: Leaving directory '/home/vagrant/slave/monero-static-win64/build/build/release/CMakeFiles/CMakeTmp'


Determining if the function gmtime_r exists failed with the following output:
Change Dir: C:/msys64/home/vagrant/slave/monero-static-win64/build/build/release/CMakeFiles/CMakeTmp

Run Build Command:"C:/msys64/usr/bin/make.exe" "cmTC_b7fee/fast"
make[1]: Entering directory '/home/vagrant/slave/monero-static-win64/build/build/release/CMakeFiles/CMakeTmp'
/usr/bin/make -f CMakeFiles/cmTC_b7fee.dir/build.make CMakeFiles/cmTC_b7fee.dir/build
make[2]: Entering directory '/home/vagrant/slave/monero-static-win64/build/build/release/CMakeFiles/CMakeTmp'
Building C object CMakeFiles/cmTC_b7fee.dir/CheckFunctionExists.c.obj

/C/msys64/mingw64/bin/x86_64-w64-mingw32-gcc.exe   -DCHECK_FUNCTION_EXISTS=gmtime_r   -o CMakeFiles/cmTC_b7fee.dir/CheckFunctionExists.c.obj   -c /C/msys64/mingw64/share/cmake-3.12/Modules/CheckFunctionExists.c
Linking C executable cmTC_b7fee.exe

/C/msys64/mingw64/bin/cmake.exe -E remove -f CMakeFiles/cmTC_b7fee.dir/objects.a
ar cr CMakeFiles/cmTC_b7fee.dir/objects.a "CMakeFiles/cmTC_b7fee.dir/CheckFunctionExists.c.obj" 
/C/msys64/mingw64/bin/x86_64-w64-mingw32-gcc.exe  -DCHECK_FUNCTION_EXISTS=gmtime_r    -Wl,--whole-archive CMakeFiles/cmTC_b7fee.dir/objects.a -Wl,--no-whole-archive  -o cmTC_b7fee.exe -Wl,--major-image-version,0,--minor-image-version,0 -liphlpapi -lws2_32 -lkernel32 -luser32 -lgdi32 -lwinspool -lshell32 -lole32 -loleaut32 -luuid -lcomdlg32 -ladvapi32 
CMakeFiles/cmTC_b7fee.dir/objects.a(CheckFunctionExists.c.obj):CheckFunctionExists.c:(.text+0x15): undefined reference to `gmtime_r'

collect2.exe: error: ld returned 1 exit status
make[2]: *** [CMakeFiles/cmTC_b7fee.dir/build.make:88: cmTC_b7fee.exe] Error 1
make[2]: Leaving directory '/home/vagrant/slave/monero-static-win64/build/build/release/CMakeFiles/CMakeTmp'
make[1]: *** [Makefile:121: cmTC_b7fee/fast] Error 2
make[1]: Leaving directory '/home/vagrant/slave/monero-static-win64/build/build/release/CMakeFiles/CMakeTmp'


Determining if the function fcntl exists failed with the following output:
Change Dir: C:/msys64/home/vagrant/slave/monero-static-win64/build/build/release/CMakeFiles/CMakeTmp

Run Build Command:"C:/msys64/usr/bin/make.exe" "cmTC_6bf31/fast"
make[1]: Entering directory '/home/vagrant/slave/monero-static-win64/build/build/release/CMakeFiles/CMakeTmp'
/usr/bin/make -f CMakeFiles/cmTC_6bf31.dir/build.make CMakeFiles/cmTC_6bf31.dir/build
make[2]: Entering directory '/home/vagrant/slave/monero-static-win64/build/build/release/CMakeFiles/CMakeTmp'
Building C object CMakeFiles/cmTC_6bf31.dir/CheckFunctionExists.c.obj

/C/msys64/mingw64/bin/x86_64-w64-mingw32-gcc.exe   -DCHECK_FUNCTION_EXISTS=fcntl   -o CMakeFiles/cmTC_6bf31.dir/CheckFunctionExists.c.obj   -c /C/msys64/mingw64/share/cmake-3.12/Modules/CheckFunctionExists.c
Linking C executable cmTC_6bf31.exe

/C/msys64/mingw64/bin/cmake.exe -E remove -f CMakeFiles/cmTC_6bf31.dir/objects.a
ar cr CMakeFiles/cmTC_6bf31.dir/objects.a "CMakeFiles/cmTC_6bf31.dir/CheckFunctionExists.c.obj" 
/C/msys64/mingw64/bin/x86_64-w64-mingw32-gcc.exe  -DCHECK_FUNCTION_EXISTS=fcntl    -Wl,--whole-archive CMakeFiles/cmTC_6bf31.dir/objects.a -Wl,--no-whole-archive  -o cmTC_6bf31.exe -Wl,--major-image-version,0,--minor-image-version,0 -liphlpapi -lws2_32 -lkernel32 -luser32 -lgdi32 -lwinspool -lshell32 -lole32 -loleaut32 -luuid -lcomdlg32 -ladvapi32 
CMakeFiles/cmTC_6bf31.dir/objects.a(CheckFunctionExists.c.obj):CheckFunctionExists.c:(.text+0x15): undefined reference to `fcntl'

collect2.exe: error: ld returned 1 exit status
make[2]: *** [CMakeFiles/cmTC_6bf31.dir/build.make:88: cmTC_6bf31.exe] Error 1
make[2]: Leaving directory '/home/vagrant/slave/monero-static-win64/build/build/release/CMakeFiles/CMakeTmp'
make[1]: *** [Makefile:121: cmTC_6bf31/fast] Error 2
make[1]: Leaving directory '/home/vagrant/slave/monero-static-win64/build/build/release/CMakeFiles/CMakeTmp'


Determining if the function inet_aton exists failed with the following output:
Change Dir: C:/msys64/home/vagrant/slave/monero-static-win64/build/build/release/CMakeFiles/CMakeTmp

Run Build Command:"C:/msys64/usr/bin/make.exe" "cmTC_b075d/fast"
make[1]: Entering directory '/home/vagrant/slave/monero-static-win64/build/build/release/CMakeFiles/CMakeTmp'
/usr/bin/make -f CMakeFiles/cmTC_b075d.dir/build.make CMakeFiles/cmTC_b075d.dir/build
make[2]: Entering directory '/home/vagrant/slave/monero-static-win64/build/build/release/CMakeFiles/CMakeTmp'
Building C object CMakeFiles/cmTC_b075d.dir/CheckFunctionExists.c.obj

/C/msys64/mingw64/bin/x86_64-w64-mingw32-gcc.exe   -DCHECK_FUNCTION_EXISTS=inet_aton   -o CMakeFiles/cmTC_b075d.dir/CheckFunctionExists.c.obj   -c /C/msys64/mingw64/share/cmake-3.12/Modules/CheckFunctionExists.c
Linking C executable cmTC_b075d.exe

/C/msys64/mingw64/bin/cmake.exe -E remove -f CMakeFiles/cmTC_b075d.dir/objects.a
ar cr CMakeFiles/cmTC_b075d.dir/objects.a "CMakeFiles/cmTC_b075d.dir/CheckFunctionExists.c.obj" 
/C/msys64/mingw64/bin/x86_64-w64-mingw32-gcc.exe  -DCHECK_FUNCTION_EXISTS=inet_aton    -Wl,--whole-archive CMakeFiles/cmTC_b075d.dir/objects.a -Wl,--no-whole-archive  -o cmTC_b075d.exe -Wl,--major-image-version,0,--minor-image-version,0 -liphlpapi -lws2_32 -lkernel32 -luser32 -lgdi32 -lwinspool -lshell32 -lole32 -loleaut32 -luuid -lcomdlg32 -ladvapi32 
CMakeFiles/cmTC_b075d.dir/objects.a(CheckFunctionExists.c.obj):CheckFunctionExists.c:(.text+0x15): undefined reference to `inet_aton'

collect2.exe: error: ld returned 1 exit status
make[2]: *** [CMakeFiles/cmTC_b075d.dir/build.make:88: cmTC_b075d.exe] Error 1
make[2]: Leaving directory '/home/vagrant/slave/monero-static-win64/build/build/release/CMakeFiles/CMakeTmp'
make[1]: *** [Makefile:121: cmTC_b075d/fast] Error 2
make[1]: Leaving directory '/home/vagrant/slave/monero-static-win64/build/build/release/CMakeFiles/CMakeTmp'


Determining if the function initgroups exists failed with the following output:
Change Dir: C:/msys64/home/vagrant/slave/monero-static-win64/build/build/release/CMakeFiles/CMakeTmp

Run Build Command:"C:/msys64/usr/bin/make.exe" "cmTC_075de/fast"
make[1]: Entering directory '/home/vagrant/slave/monero-static-win64/build/build/release/CMakeFiles/CMakeTmp'
/usr/bin/make -f CMakeFiles/cmTC_075de.dir/build.make CMakeFiles/cmTC_075de.dir/build
make[2]: Entering directory '/home/vagrant/slave/monero-static-win64/build/build/release/CMakeFiles/CMakeTmp'
Building C object CMakeFiles/cmTC_075de.dir/CheckFunctionExists.c.obj

/C/msys64/mingw64/bin/x86_64-w64-mingw32-gcc.exe   -DCHECK_FUNCTION_EXISTS=initgroups   -o CMakeFiles/cmTC_075de.dir/CheckFunctionExists.c.obj   -c /C/msys64/mingw64/share/cmake-3.12/Modules/CheckFunctionExists.c
Linking C executable cmTC_075de.exe

/C/msys64/mingw64/bin/cmake.exe -E remove -f CMakeFiles/cmTC_075de.dir/objects.a
ar cr CMakeFiles/cmTC_075de.dir/objects.a "CMakeFiles/cmTC_075de.dir/CheckFunctionExists.c.obj" 
/C/msys64/mingw64/bin/x86_64-w64-mingw32-gcc.exe  -DCHECK_FUNCTION_EXISTS=initgroups    -Wl,--whole-archive CMakeFiles/cmTC_075de.dir/objects.a -Wl,--no-whole-archive  -o cmTC_075de.exe -Wl,--major-image-version,0,--minor-image-version,0 -liphlpapi -lws2_32 -lkernel32 -luser32 -lgdi32 -lwinspool -lshell32 -lole32 -loleaut32 -luuid -lcomdlg32 -ladvapi32 
CMakeFiles/cmTC_075de.dir/objects.a(CheckFunctionExists.c.obj):CheckFunctionExists.c:(.text+0x15): undefined reference to `initgroups'

collect2.exe: error: ld returned 1 exit status
make[2]: *** [CMakeFiles/cmTC_075de.dir/build.make:88: cmTC_075de.exe] Error 1
make[2]: Leaving directory '/home/vagrant/slave/monero-static-win64/build/build/release/CMakeFiles/CMakeTmp'
make[1]: *** [Makefile:121: cmTC_075de/fast] Error 2
make[1]: Leaving directory '/home/vagrant/slave/monero-static-win64/build/build/release/CMakeFiles/CMakeTmp'


Determining if the function kill exists failed with the following output:
Change Dir: C:/msys64/home/vagrant/slave/monero-static-win64/build/build/release/CMakeFiles/CMakeTmp

Run Build Command:"C:/msys64/usr/bin/make.exe" "cmTC_bb6f3/fast"
make[1]: Entering directory '/home/vagrant/slave/monero-static-win64/build/build/release/CMakeFiles/CMakeTmp'
/usr/bin/make -f CMakeFiles/cmTC_bb6f3.dir/build.make CMakeFiles/cmTC_bb6f3.dir/build
make[2]: Entering directory '/home/vagrant/slave/monero-static-win64/build/build/release/CMakeFiles/CMakeTmp'
Building C object CMakeFiles/cmTC_bb6f3.dir/CheckFunctionExists.c.obj

/C/msys64/mingw64/bin/x86_64-w64-mingw32-gcc.exe   -DCHECK_FUNCTION_EXISTS=kill   -o CMakeFiles/cmTC_bb6f3.dir/CheckFunctionExists.c.obj   -c /C/msys64/mingw64/share/cmake-3.12/Modules/CheckFunctionExists.c
Linking C executable cmTC_bb6f3.exe

/C/msys64/mingw64/bin/cmake.exe -E remove -f CMakeFiles/cmTC_bb6f3.dir/objects.a
ar cr CMakeFiles/cmTC_bb6f3.dir/objects.a "CMakeFiles/cmTC_bb6f3.dir/CheckFunctionExists.c.obj" 
/C/msys64/mingw64/bin/x86_64-w64-mingw32-gcc.exe  -DCHECK_FUNCTION_EXISTS=kill    -Wl,--whole-archive CMakeFiles/cmTC_bb6f3.dir/objects.a -Wl,--no-whole-archive  -o cmTC_bb6f3.exe -Wl,--major-image-version,0,--minor-image-version,0 -liphlpapi -lws2_32 -lkernel32 -luser32 -lgdi32 -lwinspool -lshell32 -lole32 -loleaut32 -luuid -lcomdlg32 -ladvapi32 
CMakeFiles/cmTC_bb6f3.dir/objects.a(CheckFunctionExists.c.obj):CheckFunctionExists.c:(.text+0x15): undefined reference to `kill'

collect2.exe: error: ld returned 1 exit status
make[2]: *** [CMakeFiles/cmTC_bb6f3.dir/build.make:88: cmTC_bb6f3.exe] Error 1
make[2]: Leaving directory '/home/vagrant/slave/monero-static-win64/build/build/release/CMakeFiles/CMakeTmp'
make[1]: *** [Makefile:121: cmTC_bb6f3/fast] Error 2
make[1]: Leaving directory '/home/vagrant/slave/monero-static-win64/build/build/release/CMakeFiles/CMakeTmp'


Determining if the function localtime_r exists failed with the following output:
Change Dir: C:/msys64/home/vagrant/slave/monero-static-win64/build/build/release/CMakeFiles/CMakeTmp

Run Build Command:"C:/msys64/usr/bin/make.exe" "cmTC_ac830/fast"
make[1]: Entering directory '/home/vagrant/slave/monero-static-win64/build/build/release/CMakeFiles/CMakeTmp'
/usr/bin/make -f CMakeFiles/cmTC_ac830.dir/build.make CMakeFiles/cmTC_ac830.dir/build
make[2]: Entering directory '/home/vagrant/slave/monero-static-win64/build/build/release/CMakeFiles/CMakeTmp'
Building C object CMakeFiles/cmTC_ac830.dir/CheckFunctionExists.c.obj

/C/msys64/mingw64/bin/x86_64-w64-mingw32-gcc.exe   -DCHECK_FUNCTION_EXISTS=localtime_r   -o CMakeFiles/cmTC_ac830.dir/CheckFunctionExists.c.obj   -c /C/msys64/mingw64/share/cmake-3.12/Modules/CheckFunctionExists.c
Linking C executable cmTC_ac830.exe

/C/msys64/mingw64/bin/cmake.exe -E remove -f CMakeFiles/cmTC_ac830.dir/objects.a
ar cr CMakeFiles/cmTC_ac830.dir/objects.a "CMakeFiles/cmTC_ac830.dir/CheckFunctionExists.c.obj" 
/C/msys64/mingw64/bin/x86_64-w64-mingw32-gcc.exe  -DCHECK_FUNCTION_EXISTS=localtime_r    -Wl,--whole-archive CMakeFiles/cmTC_ac830.dir/objects.a -Wl,--no-whole-archive  -o cmTC_ac830.exe -Wl,--major-image-version,0,--minor-image-version,0 -liphlpapi -lws2_32 -lkernel32 -luser32 -lgdi32 -lwinspool -lshell32 -lole32 -loleaut32 -luuid -lcomdlg32 -ladvapi32 
CMakeFiles/cmTC_ac830.dir/objects.a(CheckFunctionExists.c.obj):CheckFunctionExists.c:(.text+0x15): undefined reference to `localtime_r'

collect2.exe: error: ld returned 1 exit status
make[2]: *** [CMakeFiles/cmTC_ac830.dir/build.make:88: cmTC_ac830.exe] Error 1
make[2]: Leaving directory '/home/vagrant/slave/monero-static-win64/build/build/release/CMakeFiles/CMakeTmp'
make[1]: *** [Makefile:121: cmTC_ac830/fast] Error 2
make[1]: Leaving directory '/home/vagrant/slave/monero-static-win64/build/build/release/CMakeFiles/CMakeTmp'


Determining if the function random exists failed with the following output:
Change Dir: C:/msys64/home/vagrant/slave/monero-static-win64/build/build/release/CMakeFiles/CMakeTmp

Run Build Command:"C:/msys64/usr/bin/make.exe" "cmTC_ecf04/fast"
make[1]: Entering directory '/home/vagrant/slave/monero-static-win64/build/build/release/CMakeFiles/CMakeTmp'
/usr/bin/make -f CMakeFiles/cmTC_ecf04.dir/build.make CMakeFiles/cmTC_ecf04.dir/build
make[2]: Entering directory '/home/vagrant/slave/monero-static-win64/build/build/release/CMakeFiles/CMakeTmp'
Building C object CMakeFiles/cmTC_ecf04.dir/CheckFunctionExists.c.obj

/C/msys64/mingw64/bin/x86_64-w64-mingw32-gcc.exe   -DCHECK_FUNCTION_EXISTS=random   -o CMakeFiles/cmTC_ecf04.dir/CheckFunctionExists.c.obj   -c /C/msys64/mingw64/share/cmake-3.12/Modules/CheckFunctionExists.c
Linking C executable cmTC_ecf04.exe

/C/msys64/mingw64/bin/cmake.exe -E remove -f CMakeFiles/cmTC_ecf04.dir/objects.a
ar cr CMakeFiles/cmTC_ecf04.dir/objects.a "CMakeFiles/cmTC_ecf04.dir/CheckFunctionExists.c.obj" 
/C/msys64/mingw64/bin/x86_64-w64-mingw32-gcc.exe  -DCHECK_FUNCTION_EXISTS=random    -Wl,--whole-archive CMakeFiles/cmTC_ecf04.dir/objects.a -Wl,--no-whole-archive  -o cmTC_ecf04.exe -Wl,--major-image-version,0,--minor-image-version,0 -liphlpapi -lws2_32 -lkernel32 -luser32 -lgdi32 -lwinspool -lshell32 -lole32 -loleaut32 -luuid -lcomdlg32 -ladvapi32 
CMakeFiles/cmTC_ecf04.dir/objects.a(CheckFunctionExists.c.obj):CheckFunctionExists.c:(.text+0x15): undefined reference to `random'

collect2.exe: error: ld returned 1 exit status
make[2]: *** [CMakeFiles/cmTC_ecf04.dir/build.make:88: cmTC_ecf04.exe] Error 1
make[2]: Leaving directory '/home/vagrant/slave/monero-static-win64/build/build/release/CMakeFiles/CMakeTmp'
make[1]: *** [Makefile:121: cmTC_ecf04/fast] Error 2
make[1]: Leaving directory '/home/vagrant/slave/monero-static-win64/build/build/release/CMakeFiles/CMakeTmp'


Determining if the function reallocarray exists failed with the following output:
Change Dir: C:/msys64/home/vagrant/slave/monero-static-win64/build/build/release/CMakeFiles/CMakeTmp

Run Build Command:"C:/msys64/usr/bin/make.exe" "cmTC_59379/fast"
make[1]: Entering directory '/home/vagrant/slave/monero-static-win64/build/build/release/CMakeFiles/CMakeTmp'
/usr/bin/make -f CMakeFiles/cmTC_59379.dir/build.make CMakeFiles/cmTC_59379.dir/build
make[2]: Entering directory '/home/vagrant/slave/monero-static-win64/build/build/release/CMakeFiles/CMakeTmp'
Building C object CMakeFiles/cmTC_59379.dir/CheckFunctionExists.c.obj

/C/msys64/mingw64/bin/x86_64-w64-mingw32-gcc.exe   -DCHECK_FUNCTION_EXISTS=reallocarray   -o CMakeFiles/cmTC_59379.dir/CheckFunctionExists.c.obj   -c /C/msys64/mingw64/share/cmake-3.12/Modules/CheckFunctionExists.c
Linking C executable cmTC_59379.exe

/C/msys64/mingw64/bin/cmake.exe -E remove -f CMakeFiles/cmTC_59379.dir/objects.a
ar cr CMakeFiles/cmTC_59379.dir/objects.a "CMakeFiles/cmTC_59379.dir/CheckFunctionExists.c.obj" 
/C/msys64/mingw64/bin/x86_64-w64-mingw32-gcc.exe  -DCHECK_FUNCTION_EXISTS=reallocarray    -Wl,--whole-archive CMakeFiles/cmTC_59379.dir/objects.a -Wl,--no-whole-archive  -o cmTC_59379.exe -Wl,--major-image-version,0,--minor-image-version,0 -liphlpapi -lws2_32 -lkernel32 -luser32 -lgdi32 -lwinspool -lshell32 -lole32 -loleaut32 -luuid -lcomdlg32 -ladvapi32 
CMakeFiles/cmTC_59379.dir/objects.a(CheckFunctionExists.c.obj):CheckFunctionExists.c:(.text+0x15): undefined reference to `reallocarray'

collect2.exe: error: ld returned 1 exit status
make[2]: *** [CMakeFiles/cmTC_59379.dir/build.make:88: cmTC_59379.exe] Error 1
make[2]: Leaving directory '/home/vagrant/slave/monero-static-win64/build/build/release/CMakeFiles/CMakeTmp'
make[1]: *** [Makefile:121: cmTC_59379/fast] Error 2
make[1]: Leaving directory '/home/vagrant/slave/monero-static-win64/build/build/release/CMakeFiles/CMakeTmp'


Determining if the function recvmsg exists failed with the following output:
Change Dir: C:/msys64/home/vagrant/slave/monero-static-win64/build/build/release/CMakeFiles/CMakeTmp

Run Build Command:"C:/msys64/usr/bin/make.exe" "cmTC_f44c8/fast"
make[1]: Entering directory '/home/vagrant/slave/monero-static-win64/build/build/release/CMakeFiles/CMakeTmp'
/usr/bin/make -f CMakeFiles/cmTC_f44c8.dir/build.make CMakeFiles/cmTC_f44c8.dir/build
make[2]: Entering directory '/home/vagrant/slave/monero-static-win64/build/build/release/CMakeFiles/CMakeTmp'
Building C object CMakeFiles/cmTC_f44c8.dir/CheckFunctionExists.c.obj

/C/msys64/mingw64/bin/x86_64-w64-mingw32-gcc.exe   -DCHECK_FUNCTION_EXISTS=recvmsg   -o CMakeFiles/cmTC_f44c8.dir/CheckFunctionExists.c.obj   -c /C/msys64/mingw64/share/cmake-3.12/Modules/CheckFunctionExists.c
Linking C executable cmTC_f44c8.exe

/C/msys64/mingw64/bin/cmake.exe -E remove -f CMakeFiles/cmTC_f44c8.dir/objects.a
ar cr CMakeFiles/cmTC_f44c8.dir/objects.a "CMakeFiles/cmTC_f44c8.dir/CheckFunctionExists.c.obj" 
/C/msys64/mingw64/bin/x86_64-w64-mingw32-gcc.exe  -DCHECK_FUNCTION_EXISTS=recvmsg    -Wl,--whole-archive CMakeFiles/cmTC_f44c8.dir/objects.a -Wl,--no-whole-archive  -o cmTC_f44c8.exe -Wl,--major-image-version,0,--minor-image-version,0 -liphlpapi -lws2_32 -lkernel32 -luser32 -lgdi32 -lwinspool -lshell32 -lole32 -loleaut32 -luuid -lcomdlg32 -ladvapi32 
CMakeFiles/cmTC_f44c8.dir/objects.a(CheckFunctionExists.c.obj):CheckFunctionExists.c:(.text+0x15): undefined reference to `recvmsg'

collect2.exe: error: ld returned 1 exit status
make[2]: *** [CMakeFiles/cmTC_f44c8.dir/build.make:88: cmTC_f44c8.exe] Error 1
make[2]: Leaving directory '/home/vagrant/slave/monero-static-win64/build/build/release/CMakeFiles/CMakeTmp'
make[1]: *** [Makefile:121: cmTC_f44c8/fast] Error 2
make[1]: Leaving directory '/home/vagrant/slave/monero-static-win64/build/build/release/CMakeFiles/CMakeTmp'


Determining if the function sbrk exists failed with the following output:
Change Dir: C:/msys64/home/vagrant/slave/monero-static-win64/build/build/release/CMakeFiles/CMakeTmp

Run Build Command:"C:/msys64/usr/bin/make.exe" "cmTC_b2cbe/fast"
make[1]: Entering directory '/home/vagrant/slave/monero-static-win64/build/build/release/CMakeFiles/CMakeTmp'
/usr/bin/make -f CMakeFiles/cmTC_b2cbe.dir/build.make CMakeFiles/cmTC_b2cbe.dir/build
make[2]: Entering directory '/home/vagrant/slave/monero-static-win64/build/build/release/CMakeFiles/CMakeTmp'
Building C object CMakeFiles/cmTC_b2cbe.dir/CheckFunctionExists.c.obj

/C/msys64/mingw64/bin/x86_64-w64-mingw32-gcc.exe   -DCHECK_FUNCTION_EXISTS=sbrk   -o CMakeFiles/cmTC_b2cbe.dir/CheckFunctionExists.c.obj   -c /C/msys64/mingw64/share/cmake-3.12/Modules/CheckFunctionExists.c
Linking C executable cmTC_b2cbe.exe

/C/msys64/mingw64/bin/cmake.exe -E remove -f CMakeFiles/cmTC_b2cbe.dir/objects.a
ar cr CMakeFiles/cmTC_b2cbe.dir/objects.a "CMakeFiles/cmTC_b2cbe.dir/CheckFunctionExists.c.obj" 
/C/msys64/mingw64/bin/x86_64-w64-mingw32-gcc.exe  -DCHECK_FUNCTION_EXISTS=sbrk    -Wl,--whole-archive CMakeFiles/cmTC_b2cbe.dir/objects.a -Wl,--no-whole-archive  -o cmTC_b2cbe.exe -Wl,--major-image-version,0,--minor-image-version,0 -liphlpapi -lws2_32 -lkernel32 -luser32 -lgdi32 -lwinspool -lshell32 -lole32 -loleaut32 -luuid -lcomdlg32 -ladvapi32 
CMakeFiles/cmTC_b2cbe.dir/objects.a(CheckFunctionExists.c.obj):CheckFunctionExists.c:(.text+0x15): undefined reference to `sbrk'

collect2.exe: error: ld returned 1 exit status
make[2]: *** [CMakeFiles/cmTC_b2cbe.dir/build.make:88: cmTC_b2cbe.exe] Error 1
make[2]: Leaving directory '/home/vagrant/slave/monero-static-win64/build/build/release/CMakeFiles/CMakeTmp'
make[1]: *** [Makefile:121: cmTC_b2cbe/fast] Error 2
make[1]: Leaving directory '/home/vagrant/slave/monero-static-win64/build/build/release/CMakeFiles/CMakeTmp'


Determining if the function sendmsg exists failed with the following output:
Change Dir: C:/msys64/home/vagrant/slave/monero-static-win64/build/build/release/CMakeFiles/CMakeTmp

Run Build Command:"C:/msys64/usr/bin/make.exe" "cmTC_cc14c/fast"
make[1]: Entering directory '/home/vagrant/slave/monero-static-win64/build/build/release/CMakeFiles/CMakeTmp'
/usr/bin/make -f CMakeFiles/cmTC_cc14c.dir/build.make CMakeFiles/cmTC_cc14c.dir/build
make[2]: Entering directory '/home/vagrant/slave/monero-static-win64/build/build/release/CMakeFiles/CMakeTmp'
Building C object CMakeFiles/cmTC_cc14c.dir/CheckFunctionExists.c.obj

/C/msys64/mingw64/bin/x86_64-w64-mingw32-gcc.exe   -DCHECK_FUNCTION_EXISTS=sendmsg   -o CMakeFiles/cmTC_cc14c.dir/CheckFunctionExists.c.obj   -c /C/msys64/mingw64/share/cmake-3.12/Modules/CheckFunctionExists.c
Linking C executable cmTC_cc14c.exe

/C/msys64/mingw64/bin/cmake.exe -E remove -f CMakeFiles/cmTC_cc14c.dir/objects.a
ar cr CMakeFiles/cmTC_cc14c.dir/objects.a "CMakeFiles/cmTC_cc14c.dir/CheckFunctionExists.c.obj" 
/C/msys64/mingw64/bin/x86_64-w64-mingw32-gcc.exe  -DCHECK_FUNCTION_EXISTS=sendmsg    -Wl,--whole-archive CMakeFiles/cmTC_cc14c.dir/objects.a -Wl,--no-whole-archive  -o cmTC_cc14c.exe -Wl,--major-image-version,0,--minor-image-version,0 -liphlpapi -lws2_32 -lkernel32 -luser32 -lgdi32 -lwinspool -lshell32 -lole32 -loleaut32 -luuid -lcomdlg32 -ladvapi32 
CMakeFiles/cmTC_cc14c.dir/objects.a(CheckFunctionExists.c.obj):CheckFunctionExists.c:(.text+0x15): undefined reference to `sendmsg'

collect2.exe: error: ld returned 1 exit status
make[2]: *** [CMakeFiles/cmTC_cc14c.dir/build.make:88: cmTC_cc14c.exe] Error 1
make[2]: Leaving directory '/home/vagrant/slave/monero-static-win64/build/build/release/CMakeFiles/CMakeTmp'
make[1]: *** [Makefile:121: cmTC_cc14c/fast] Error 2
make[1]: Leaving directory '/home/vagrant/slave/monero-static-win64/build/build/release/CMakeFiles/CMakeTmp'


Determining if the function setregid exists failed with the following output:
Change Dir: C:/msys64/home/vagrant/slave/monero-static-win64/build/build/release/CMakeFiles/CMakeTmp

Run Build Command:"C:/msys64/usr/bin/make.exe" "cmTC_9b803/fast"
make[1]: Entering directory '/home/vagrant/slave/monero-static-win64/build/build/release/CMakeFiles/CMakeTmp'
/usr/bin/make -f CMakeFiles/cmTC_9b803.dir/build.make CMakeFiles/cmTC_9b803.dir/build
make[2]: Entering directory '/home/vagrant/slave/monero-static-win64/build/build/release/CMakeFiles/CMakeTmp'
Building C object CMakeFiles/cmTC_9b803.dir/CheckFunctionExists.c.obj

/C/msys64/mingw64/bin/x86_64-w64-mingw32-gcc.exe   -DCHECK_FUNCTION_EXISTS=setregid   -o CMakeFiles/cmTC_9b803.dir/CheckFunctionExists.c.obj   -c /C/msys64/mingw64/share/cmake-3.12/Modules/CheckFunctionExists.c
Linking C executable cmTC_9b803.exe

/C/msys64/mingw64/bin/cmake.exe -E remove -f CMakeFiles/cmTC_9b803.dir/objects.a
ar cr CMakeFiles/cmTC_9b803.dir/objects.a "CMakeFiles/cmTC_9b803.dir/CheckFunctionExists.c.obj" 
/C/msys64/mingw64/bin/x86_64-w64-mingw32-gcc.exe  -DCHECK_FUNCTION_EXISTS=setregid    -Wl,--whole-archive CMakeFiles/cmTC_9b803.dir/objects.a -Wl,--no-whole-archive  -o cmTC_9b803.exe -Wl,--major-image-version,0,--minor-image-version,0 -liphlpapi -lws2_32 -lkernel32 -luser32 -lgdi32 -lwinspool -lshell32 -lole32 -loleaut32 -luuid -lcomdlg32 -ladvapi32 
CMakeFiles/cmTC_9b803.dir/objects.a(CheckFunctionExists.c.obj):CheckFunctionExists.c:(.text+0x15): undefined reference to `setregid'

collect2.exe: error: ld returned 1 exit status
make[2]: *** [CMakeFiles/cmTC_9b803.dir/build.make:88: cmTC_9b803.exe] Error 1
make[2]: Leaving directory '/home/vagrant/slave/monero-static-win64/build/build/release/CMakeFiles/CMakeTmp'
make[1]: *** [Makefile:121: cmTC_9b803/fast] Error 2
make[1]: Leaving directory '/home/vagrant/slave/monero-static-win64/build/build/release/CMakeFiles/CMakeTmp'


Determining if the function setresgid exists failed with the following output:
Change Dir: C:/msys64/home/vagrant/slave/monero-static-win64/build/build/release/CMakeFiles/CMakeTmp

Run Build Command:"C:/msys64/usr/bin/make.exe" "cmTC_11e7a/fast"
make[1]: Entering directory '/home/vagrant/slave/monero-static-win64/build/build/release/CMakeFiles/CMakeTmp'
/usr/bin/make -f CMakeFiles/cmTC_11e7a.dir/build.make CMakeFiles/cmTC_11e7a.dir/build
make[2]: Entering directory '/home/vagrant/slave/monero-static-win64/build/build/release/CMakeFiles/CMakeTmp'
Building C object CMakeFiles/cmTC_11e7a.dir/CheckFunctionExists.c.obj

/C/msys64/mingw64/bin/x86_64-w64-mingw32-gcc.exe   -DCHECK_FUNCTION_EXISTS=setresgid   -o CMakeFiles/cmTC_11e7a.dir/CheckFunctionExists.c.obj   -c /C/msys64/mingw64/share/cmake-3.12/Modules/CheckFunctionExists.c
Linking C executable cmTC_11e7a.exe

/C/msys64/mingw64/bin/cmake.exe -E remove -f CMakeFiles/cmTC_11e7a.dir/objects.a
ar cr CMakeFiles/cmTC_11e7a.dir/objects.a "CMakeFiles/cmTC_11e7a.dir/CheckFunctionExists.c.obj" 
/C/msys64/mingw64/bin/x86_64-w64-mingw32-gcc.exe  -DCHECK_FUNCTION_EXISTS=setresgid    -Wl,--whole-archive CMakeFiles/cmTC_11e7a.dir/objects.a -Wl,--no-whole-archive  -o cmTC_11e7a.exe -Wl,--major-image-version,0,--minor-image-version,0 -liphlpapi -lws2_32 -lkernel32 -luser32 -lgdi32 -lwinspool -lshell32 -lole32 -loleaut32 -luuid -lcomdlg32 -ladvapi32 
CMakeFiles/cmTC_11e7a.dir/objects.a(CheckFunctionExists.c.obj):CheckFunctionExists.c:(.text+0x15): undefined reference to `setresgid'

collect2.exe: error: ld returned 1 exit status
make[2]: *** [CMakeFiles/cmTC_11e7a.dir/build.make:88: cmTC_11e7a.exe] Error 1
make[2]: Leaving directory '/home/vagrant/slave/monero-static-win64/build/build/release/CMakeFiles/CMakeTmp'
make[1]: *** [Makefile:121: cmTC_11e7a/fast] Error 2
make[1]: Leaving directory '/home/vagrant/slave/monero-static-win64/build/build/release/CMakeFiles/CMakeTmp'


Determining if the function setresuid exists failed with the following output:
Change Dir: C:/msys64/home/vagrant/slave/monero-static-win64/build/build/release/CMakeFiles/CMakeTmp

Run Build Command:"C:/msys64/usr/bin/make.exe" "cmTC_b384a/fast"
make[1]: Entering directory '/home/vagrant/slave/monero-static-win64/build/build/release/CMakeFiles/CMakeTmp'
/usr/bin/make -f CMakeFiles/cmTC_b384a.dir/build.make CMakeFiles/cmTC_b384a.dir/build
make[2]: Entering directory '/home/vagrant/slave/monero-static-win64/build/build/release/CMakeFiles/CMakeTmp'
Building C object CMakeFiles/cmTC_b384a.dir/CheckFunctionExists.c.obj

/C/msys64/mingw64/bin/x86_64-w64-mingw32-gcc.exe   -DCHECK_FUNCTION_EXISTS=setresuid   -o CMakeFiles/cmTC_b384a.dir/CheckFunctionExists.c.obj   -c /C/msys64/mingw64/share/cmake-3.12/Modules/CheckFunctionExists.c
Linking C executable cmTC_b384a.exe

/C/msys64/mingw64/bin/cmake.exe -E remove -f CMakeFiles/cmTC_b384a.dir/objects.a
ar cr CMakeFiles/cmTC_b384a.dir/objects.a "CMakeFiles/cmTC_b384a.dir/CheckFunctionExists.c.obj" 
/C/msys64/mingw64/bin/x86_64-w64-mingw32-gcc.exe  -DCHECK_FUNCTION_EXISTS=setresuid    -Wl,--whole-archive CMakeFiles/cmTC_b384a.dir/objects.a -Wl,--no-whole-archive  -o cmTC_b384a.exe -Wl,--major-image-version,0,--minor-image-version,0 -liphlpapi -lws2_32 -lkernel32 -luser32 -lgdi32 -lwinspool -lshell32 -lole32 -loleaut32 -luuid -lcomdlg32 -ladvapi32 
CMakeFiles/cmTC_b384a.dir/objects.a(CheckFunctionExists.c.obj):CheckFunctionExists.c:(.text+0x15): undefined reference to `setresuid'

collect2.exe: error: ld returned 1 exit status
make[2]: *** [CMakeFiles/cmTC_b384a.dir/build.make:88: cmTC_b384a.exe] Error 1
make[2]: Leaving directory '/home/vagrant/slave/monero-static-win64/build/build/release/CMakeFiles/CMakeTmp'
make[1]: *** [Makefile:121: cmTC_b384a/fast] Error 2
make[1]: Leaving directory '/home/vagrant/slave/monero-static-win64/build/build/release/CMakeFiles/CMakeTmp'


Determining if the function setreuid exists failed with the following output:
Change Dir: C:/msys64/home/vagrant/slave/monero-static-win64/build/build/release/CMakeFiles/CMakeTmp

Run Build Command:"C:/msys64/usr/bin/make.exe" "cmTC_05ffa/fast"
make[1]: Entering directory '/home/vagrant/slave/monero-static-win64/build/build/release/CMakeFiles/CMakeTmp'
/usr/bin/make -f CMakeFiles/cmTC_05ffa.dir/build.make CMakeFiles/cmTC_05ffa.dir/build
make[2]: Entering directory '/home/vagrant/slave/monero-static-win64/build/build/release/CMakeFiles/CMakeTmp'
Building C object CMakeFiles/cmTC_05ffa.dir/CheckFunctionExists.c.obj

/C/msys64/mingw64/bin/x86_64-w64-mingw32-gcc.exe   -DCHECK_FUNCTION_EXISTS=setreuid   -o CMakeFiles/cmTC_05ffa.dir/CheckFunctionExists.c.obj   -c /C/msys64/mingw64/share/cmake-3.12/Modules/CheckFunctionExists.c
Linking C executable cmTC_05ffa.exe

/C/msys64/mingw64/bin/cmake.exe -E remove -f CMakeFiles/cmTC_05ffa.dir/objects.a
ar cr CMakeFiles/cmTC_05ffa.dir/objects.a "CMakeFiles/cmTC_05ffa.dir/CheckFunctionExists.c.obj" 
/C/msys64/mingw64/bin/x86_64-w64-mingw32-gcc.exe  -DCHECK_FUNCTION_EXISTS=setreuid    -Wl,--whole-archive CMakeFiles/cmTC_05ffa.dir/objects.a -Wl,--no-whole-archive  -o cmTC_05ffa.exe -Wl,--major-image-version,0,--minor-image-version,0 -liphlpapi -lws2_32 -lkernel32 -luser32 -lgdi32 -lwinspool -lshell32 -lole32 -loleaut32 -luuid -lcomdlg32 -ladvapi32 
CMakeFiles/cmTC_05ffa.dir/objects.a(CheckFunctionExists.c.obj):CheckFunctionExists.c:(.text+0x15): undefined reference to `setreuid'

collect2.exe: error: ld returned 1 exit status
make[2]: *** [CMakeFiles/cmTC_05ffa.dir/build.make:88: cmTC_05ffa.exe] Error 1
make[2]: Leaving directory '/home/vagrant/slave/monero-static-win64/build/build/release/CMakeFiles/CMakeTmp'
make[1]: *** [Makefile:121: cmTC_05ffa/fast] Error 2
make[1]: Leaving directory '/home/vagrant/slave/monero-static-win64/build/build/release/CMakeFiles/CMakeTmp'


Determining if the function setrlimit exists failed with the following output:
Change Dir: C:/msys64/home/vagrant/slave/monero-static-win64/build/build/release/CMakeFiles/CMakeTmp

Run Build Command:"C:/msys64/usr/bin/make.exe" "cmTC_8a36a/fast"
make[1]: Entering directory '/home/vagrant/slave/monero-static-win64/build/build/release/CMakeFiles/CMakeTmp'
/usr/bin/make -f CMakeFiles/cmTC_8a36a.dir/build.make CMakeFiles/cmTC_8a36a.dir/build
make[2]: Entering directory '/home/vagrant/slave/monero-static-win64/build/build/release/CMakeFiles/CMakeTmp'
Building C object CMakeFiles/cmTC_8a36a.dir/CheckFunctionExists.c.obj

/C/msys64/mingw64/bin/x86_64-w64-mingw32-gcc.exe   -DCHECK_FUNCTION_EXISTS=setrlimit   -o CMakeFiles/cmTC_8a36a.dir/CheckFunctionExists.c.obj   -c /C/msys64/mingw64/share/cmake-3.12/Modules/CheckFunctionExists.c
Linking C executable cmTC_8a36a.exe

/C/msys64/mingw64/bin/cmake.exe -E remove -f CMakeFiles/cmTC_8a36a.dir/objects.a
ar cr CMakeFiles/cmTC_8a36a.dir/objects.a "CMakeFiles/cmTC_8a36a.dir/CheckFunctionExists.c.obj" 
/C/msys64/mingw64/bin/x86_64-w64-mingw32-gcc.exe  -DCHECK_FUNCTION_EXISTS=setrlimit    -Wl,--whole-archive CMakeFiles/cmTC_8a36a.dir/objects.a -Wl,--no-whole-archive  -o cmTC_8a36a.exe -Wl,--major-image-version,0,--minor-image-version,0 -liphlpapi -lws2_32 -lkernel32 -luser32 -lgdi32 -lwinspool -lshell32 -lole32 -loleaut32 -luuid -lcomdlg32 -ladvapi32 
CMakeFiles/cmTC_8a36a.dir/objects.a(CheckFunctionExists.c.obj):CheckFunctionExists.c:(.text+0x15): undefined reference to `setrlimit'

collect2.exe: error: ld returned 1 exit status
make[2]: *** [CMakeFiles/cmTC_8a36a.dir/build.make:88: cmTC_8a36a.exe] Error 1
make[2]: Leaving directory '/home/vagrant/slave/monero-static-win64/build/build/release/CMakeFiles/CMakeTmp'
make[1]: *** [Makefile:121: cmTC_8a36a/fast] Error 2
make[1]: Leaving directory '/home/vagrant/slave/monero-static-win64/build/build/release/CMakeFiles/CMakeTmp'


Determining if the function setsid exists failed with the following output:
Change Dir: C:/msys64/home/vagrant/slave/monero-static-win64/build/build/release/CMakeFiles/CMakeTmp

Run Build Command:"C:/msys64/usr/bin/make.exe" "cmTC_6802a/fast"
make[1]: Entering directory '/home/vagrant/slave/monero-static-win64/build/build/release/CMakeFiles/CMakeTmp'
/usr/bin/make -f CMakeFiles/cmTC_6802a.dir/build.make CMakeFiles/cmTC_6802a.dir/build
make[2]: Entering directory '/home/vagrant/slave/monero-static-win64/build/build/release/CMakeFiles/CMakeTmp'
Building C object CMakeFiles/cmTC_6802a.dir/CheckFunctionExists.c.obj

/C/msys64/mingw64/bin/x86_64-w64-mingw32-gcc.exe   -DCHECK_FUNCTION_EXISTS=setsid   -o CMakeFiles/cmTC_6802a.dir/CheckFunctionExists.c.obj   -c /C/msys64/mingw64/share/cmake-3.12/Modules/CheckFunctionExists.c
Linking C executable cmTC_6802a.exe

/C/msys64/mingw64/bin/cmake.exe -E remove -f CMakeFiles/cmTC_6802a.dir/objects.a
ar cr CMakeFiles/cmTC_6802a.dir/objects.a "CMakeFiles/cmTC_6802a.dir/CheckFunctionExists.c.obj" 
/C/msys64/mingw64/bin/x86_64-w64-mingw32-gcc.exe  -DCHECK_FUNCTION_EXISTS=setsid    -Wl,--whole-archive CMakeFiles/cmTC_6802a.dir/objects.a -Wl,--no-whole-archive  -o cmTC_6802a.exe -Wl,--major-image-version,0,--minor-image-version,0 -liphlpapi -lws2_32 -lkernel32 -luser32 -lgdi32 -lwinspool -lshell32 -lole32 -loleaut32 -luuid -lcomdlg32 -ladvapi32 
CMakeFiles/cmTC_6802a.dir/objects.a(CheckFunctionExists.c.obj):CheckFunctionExists.c:(.text+0x15): undefined reference to `setsid'

collect2.exe: error: ld returned 1 exit status
make[2]: *** [CMakeFiles/cmTC_6802a.dir/build.make:88: cmTC_6802a.exe] Error 1
make[2]: Leaving directory '/home/vagrant/slave/monero-static-win64/build/build/release/CMakeFiles/CMakeTmp'
make[1]: *** [Makefile:121: cmTC_6802a/fast] Error 2
make[1]: Leaving directory '/home/vagrant/slave/monero-static-win64/build/build/release/CMakeFiles/CMakeTmp'


Determining if the function setusercontent exists failed with the following output:
Change Dir: C:/msys64/home/vagrant/slave/monero-static-win64/build/build/release/CMakeFiles/CMakeTmp

Run Build Command:"C:/msys64/usr/bin/make.exe" "cmTC_951d1/fast"
make[1]: Entering directory '/home/vagrant/slave/monero-static-win64/build/build/release/CMakeFiles/CMakeTmp'
/usr/bin/make -f CMakeFiles/cmTC_951d1.dir/build.make CMakeFiles/cmTC_951d1.dir/build
make[2]: Entering directory '/home/vagrant/slave/monero-static-win64/build/build/release/CMakeFiles/CMakeTmp'
Building C object CMakeFiles/cmTC_951d1.dir/CheckFunctionExists.c.obj

/C/msys64/mingw64/bin/x86_64-w64-mingw32-gcc.exe   -DCHECK_FUNCTION_EXISTS=setusercontent   -o CMakeFiles/cmTC_951d1.dir/CheckFunctionExists.c.obj   -c /C/msys64/mingw64/share/cmake-3.12/Modules/CheckFunctionExists.c
Linking C executable cmTC_951d1.exe

/C/msys64/mingw64/bin/cmake.exe -E remove -f CMakeFiles/cmTC_951d1.dir/objects.a
ar cr CMakeFiles/cmTC_951d1.dir/objects.a "CMakeFiles/cmTC_951d1.dir/CheckFunctionExists.c.obj" 
/C/msys64/mingw64/bin/x86_64-w64-mingw32-gcc.exe  -DCHECK_FUNCTION_EXISTS=setusercontent    -Wl,--whole-archive CMakeFiles/cmTC_951d1.dir/objects.a -Wl,--no-whole-archive  -o cmTC_951d1.exe -Wl,--major-image-version,0,--minor-image-version,0 -liphlpapi -lws2_32 -lkernel32 -luser32 -lgdi32 -lwinspool -lshell32 -lole32 -loleaut32 -luuid -lcomdlg32 -ladvapi32 
CMakeFiles/cmTC_951d1.dir/objects.a(CheckFunctionExists.c.obj):CheckFunctionExists.c:(.text+0x15): undefined reference to `setusercontent'

collect2.exe: error: ld returned 1 exit status
make[2]: *** [CMakeFiles/cmTC_951d1.dir/build.make:88: cmTC_951d1.exe] Error 1
make[2]: Leaving directory '/home/vagrant/slave/monero-static-win64/build/build/release/CMakeFiles/CMakeTmp'
make[1]: *** [Makefile:121: cmTC_951d1/fast] Error 2
make[1]: Leaving directory '/home/vagrant/slave/monero-static-win64/build/build/release/CMakeFiles/CMakeTmp'


Determining if the function sigprocmask exists failed with the following output:
Change Dir: C:/msys64/home/vagrant/slave/monero-static-win64/build/build/release/CMakeFiles/CMakeTmp

Run Build Command:"C:/msys64/usr/bin/make.exe" "cmTC_67fc4/fast"
make[1]: Entering directory '/home/vagrant/slave/monero-static-win64/build/build/release/CMakeFiles/CMakeTmp'
/usr/bin/make -f CMakeFiles/cmTC_67fc4.dir/build.make CMakeFiles/cmTC_67fc4.dir/build
make[2]: Entering directory '/home/vagrant/slave/monero-static-win64/build/build/release/CMakeFiles/CMakeTmp'
Building C object CMakeFiles/cmTC_67fc4.dir/CheckFunctionExists.c.obj

/C/msys64/mingw64/bin/x86_64-w64-mingw32-gcc.exe   -DCHECK_FUNCTION_EXISTS=sigprocmask   -o CMakeFiles/cmTC_67fc4.dir/CheckFunctionExists.c.obj   -c /C/msys64/mingw64/share/cmake-3.12/Modules/CheckFunctionExists.c
Linking C executable cmTC_67fc4.exe

/C/msys64/mingw64/bin/cmake.exe -E remove -f CMakeFiles/cmTC_67fc4.dir/objects.a
ar cr CMakeFiles/cmTC_67fc4.dir/objects.a "CMakeFiles/cmTC_67fc4.dir/CheckFunctionExists.c.obj" 
/C/msys64/mingw64/bin/x86_64-w64-mingw32-gcc.exe  -DCHECK_FUNCTION_EXISTS=sigprocmask    -Wl,--whole-archive CMakeFiles/cmTC_67fc4.dir/objects.a -Wl,--no-whole-archive  -o cmTC_67fc4.exe -Wl,--major-image-version,0,--minor-image-version,0 -liphlpapi -lws2_32 -lkernel32 -luser32 -lgdi32 -lwinspool -lshell32 -lole32 -loleaut32 -luuid -lcomdlg32 -ladvapi32 
CMakeFiles/cmTC_67fc4.dir/objects.a(CheckFunctionExists.c.obj):CheckFunctionExists.c:(.text+0x15): undefined reference to `sigprocmask'

collect2.exe: error: ld returned 1 exit status
make[2]: *** [CMakeFiles/cmTC_67fc4.dir/build.make:88: cmTC_67fc4.exe] Error 1
make[2]: Leaving directory '/home/vagrant/slave/monero-static-win64/build/build/release/CMakeFiles/CMakeTmp'
make[1]: *** [Makefile:121: cmTC_67fc4/fast] Error 2
make[1]: Leaving directory '/home/vagrant/slave/monero-static-win64/build/build/release/CMakeFiles/CMakeTmp'


Determining if the function socketpair exists failed with the following output:
Change Dir: C:/msys64/home/vagrant/slave/monero-static-win64/build/build/release/CMakeFiles/CMakeTmp

Run Build Command:"C:/msys64/usr/bin/make.exe" "cmTC_d38b7/fast"
make[1]: Entering directory '/home/vagrant/slave/monero-static-win64/build/build/release/CMakeFiles/CMakeTmp'
/usr/bin/make -f CMakeFiles/cmTC_d38b7.dir/build.make CMakeFiles/cmTC_d38b7.dir/build
make[2]: Entering directory '/home/vagrant/slave/monero-static-win64/build/build/release/CMakeFiles/CMakeTmp'
Building C object CMakeFiles/cmTC_d38b7.dir/CheckFunctionExists.c.obj

/C/msys64/mingw64/bin/x86_64-w64-mingw32-gcc.exe   -DCHECK_FUNCTION_EXISTS=socketpair   -o CMakeFiles/cmTC_d38b7.dir/CheckFunctionExists.c.obj   -c /C/msys64/mingw64/share/cmake-3.12/Modules/CheckFunctionExists.c
Linking C executable cmTC_d38b7.exe

/C/msys64/mingw64/bin/cmake.exe -E remove -f CMakeFiles/cmTC_d38b7.dir/objects.a
ar cr CMakeFiles/cmTC_d38b7.dir/objects.a "CMakeFiles/cmTC_d38b7.dir/CheckFunctionExists.c.obj" 
/C/msys64/mingw64/bin/x86_64-w64-mingw32-gcc.exe  -DCHECK_FUNCTION_EXISTS=socketpair    -Wl,--whole-archive CMakeFiles/cmTC_d38b7.dir/objects.a -Wl,--no-whole-archive  -o cmTC_d38b7.exe -Wl,--major-image-version,0,--minor-image-version,0 -liphlpapi -lws2_32 -lkernel32 -luser32 -lgdi32 -lwinspool -lshell32 -lole32 -loleaut32 -luuid -lcomdlg32 -ladvapi32 
CMakeFiles/cmTC_d38b7.dir/objects.a(CheckFunctionExists.c.obj):CheckFunctionExists.c:(.text+0x15): undefined reference to `socketpair'

collect2.exe: error: ld returned 1 exit status
make[2]: *** [CMakeFiles/cmTC_d38b7.dir/build.make:88: cmTC_d38b7.exe] Error 1
make[2]: Leaving directory '/home/vagrant/slave/monero-static-win64/build/build/release/CMakeFiles/CMakeTmp'
make[1]: *** [Makefile:121: cmTC_d38b7/fast] Error 2
make[1]: Leaving directory '/home/vagrant/slave/monero-static-win64/build/build/release/CMakeFiles/CMakeTmp'


Determining if the function srandom exists failed with the following output:
Change Dir: C:/msys64/home/vagrant/slave/monero-static-win64/build/build/release/CMakeFiles/CMakeTmp

Run Build Command:"C:/msys64/usr/bin/make.exe" "cmTC_64aa1/fast"
make[1]: Entering directory '/home/vagrant/slave/monero-static-win64/build/build/release/CMakeFiles/CMakeTmp'
/usr/bin/make -f CMakeFiles/cmTC_64aa1.dir/build.make CMakeFiles/cmTC_64aa1.dir/build
make[2]: Entering directory '/home/vagrant/slave/monero-static-win64/build/build/release/CMakeFiles/CMakeTmp'
Building C object CMakeFiles/cmTC_64aa1.dir/CheckFunctionExists.c.obj

/C/msys64/mingw64/bin/x86_64-w64-mingw32-gcc.exe   -DCHECK_FUNCTION_EXISTS=srandom   -o CMakeFiles/cmTC_64aa1.dir/CheckFunctionExists.c.obj   -c /C/msys64/mingw64/share/cmake-3.12/Modules/CheckFunctionExists.c
Linking C executable cmTC_64aa1.exe

/C/msys64/mingw64/bin/cmake.exe -E remove -f CMakeFiles/cmTC_64aa1.dir/objects.a
ar cr CMakeFiles/cmTC_64aa1.dir/objects.a "CMakeFiles/cmTC_64aa1.dir/CheckFunctionExists.c.obj" 
/C/msys64/mingw64/bin/x86_64-w64-mingw32-gcc.exe  -DCHECK_FUNCTION_EXISTS=srandom    -Wl,--whole-archive CMakeFiles/cmTC_64aa1.dir/objects.a -Wl,--no-whole-archive  -o cmTC_64aa1.exe -Wl,--major-image-version,0,--minor-image-version,0 -liphlpapi -lws2_32 -lkernel32 -luser32 -lgdi32 -lwinspool -lshell32 -lole32 -loleaut32 -luuid -lcomdlg32 -ladvapi32 
CMakeFiles/cmTC_64aa1.dir/objects.a(CheckFunctionExists.c.obj):CheckFunctionExists.c:(.text+0x15): undefined reference to `srandom'

collect2.exe: error: ld returned 1 exit status
make[2]: *** [CMakeFiles/cmTC_64aa1.dir/build.make:88: cmTC_64aa1.exe] Error 1
make[2]: Leaving directory '/home/vagrant/slave/monero-static-win64/build/build/release/CMakeFiles/CMakeTmp'
make[1]: *** [Makefile:121: cmTC_64aa1/fast] Error 2
make[1]: Leaving directory '/home/vagrant/slave/monero-static-win64/build/build/release/CMakeFiles/CMakeTmp'


Determining if the function strsep exists failed with the following output:
Change Dir: C:/msys64/home/vagrant/slave/monero-static-win64/build/build/release/CMakeFiles/CMakeTmp

Run Build Command:"C:/msys64/usr/bin/make.exe" "cmTC_5979a/fast"
make[1]: Entering directory '/home/vagrant/slave/monero-static-win64/build/build/release/CMakeFiles/CMakeTmp'
/usr/bin/make -f CMakeFiles/cmTC_5979a.dir/build.make CMakeFiles/cmTC_5979a.dir/build
make[2]: Entering directory '/home/vagrant/slave/monero-static-win64/build/build/release/CMakeFiles/CMakeTmp'
Building C object CMakeFiles/cmTC_5979a.dir/CheckFunctionExists.c.obj

/C/msys64/mingw64/bin/x86_64-w64-mingw32-gcc.exe   -DCHECK_FUNCTION_EXISTS=strsep   -o CMakeFiles/cmTC_5979a.dir/CheckFunctionExists.c.obj   -c /C/msys64/mingw64/share/cmake-3.12/Modules/CheckFunctionExists.c
Linking C executable cmTC_5979a.exe

/C/msys64/mingw64/bin/cmake.exe -E remove -f CMakeFiles/cmTC_5979a.dir/objects.a
ar cr CMakeFiles/cmTC_5979a.dir/objects.a "CMakeFiles/cmTC_5979a.dir/CheckFunctionExists.c.obj" 
/C/msys64/mingw64/bin/x86_64-w64-mingw32-gcc.exe  -DCHECK_FUNCTION_EXISTS=strsep    -Wl,--whole-archive CMakeFiles/cmTC_5979a.dir/objects.a -Wl,--no-whole-archive  -o cmTC_5979a.exe -Wl,--major-image-version,0,--minor-image-version,0 -liphlpapi -lws2_32 -lkernel32 -luser32 -lgdi32 -lwinspool -lshell32 -lole32 -loleaut32 -luuid -lcomdlg32 -ladvapi32 
CMakeFiles/cmTC_5979a.dir/objects.a(CheckFunctionExists.c.obj):CheckFunctionExists.c:(.text+0x15): undefined reference to `strsep'

collect2.exe: error: ld returned 1 exit status
make[2]: *** [CMakeFiles/cmTC_5979a.dir/build.make:88: cmTC_5979a.exe] Error 1
make[2]: Leaving directory '/home/vagrant/slave/monero-static-win64/build/build/release/CMakeFiles/CMakeTmp'
make[1]: *** [Makefile:121: cmTC_5979a/fast] Error 2
make[1]: Leaving directory '/home/vagrant/slave/monero-static-win64/build/build/release/CMakeFiles/CMakeTmp'


Determining if the function strlcat exists failed with the following output:
Change Dir: C:/msys64/home/vagrant/slave/monero-static-win64/build/build/release/CMakeFiles/CMakeTmp

Run Build Command:"C:/msys64/usr/bin/make.exe" "cmTC_fc5c3/fast"
make[1]: Entering directory '/home/vagrant/slave/monero-static-win64/build/build/release/CMakeFiles/CMakeTmp'
/usr/bin/make -f CMakeFiles/cmTC_fc5c3.dir/build.make CMakeFiles/cmTC_fc5c3.dir/build
make[2]: Entering directory '/home/vagrant/slave/monero-static-win64/build/build/release/CMakeFiles/CMakeTmp'
Building C object CMakeFiles/cmTC_fc5c3.dir/CheckFunctionExists.c.obj

/C/msys64/mingw64/bin/x86_64-w64-mingw32-gcc.exe   -DCHECK_FUNCTION_EXISTS=strlcat   -o CMakeFiles/cmTC_fc5c3.dir/CheckFunctionExists.c.obj   -c /C/msys64/mingw64/share/cmake-3.12/Modules/CheckFunctionExists.c
Linking C executable cmTC_fc5c3.exe

/C/msys64/mingw64/bin/cmake.exe -E remove -f CMakeFiles/cmTC_fc5c3.dir/objects.a
ar cr CMakeFiles/cmTC_fc5c3.dir/objects.a "CMakeFiles/cmTC_fc5c3.dir/CheckFunctionExists.c.obj" 
/C/msys64/mingw64/bin/x86_64-w64-mingw32-gcc.exe  -DCHECK_FUNCTION_EXISTS=strlcat    -Wl,--whole-archive CMakeFiles/cmTC_fc5c3.dir/objects.a -Wl,--no-whole-archive  -o cmTC_fc5c3.exe -Wl,--major-image-version,0,--minor-image-version,0 -liphlpapi -lws2_32 -lkernel32 -luser32 -lgdi32 -lwinspool -lshell32 -lole32 -loleaut32 -luuid -lcomdlg32 -ladvapi32 
CMakeFiles/cmTC_fc5c3.dir/objects.a(CheckFunctionExists.c.obj):CheckFunctionExists.c:(.text+0x15): undefined reference to `strlcat'

collect2.exe: error: ld returned 1 exit status
make[2]: *** [CMakeFiles/cmTC_fc5c3.dir/build.make:88: cmTC_fc5c3.exe] Error 1
make[2]: Leaving directory '/home/vagrant/slave/monero-static-win64/build/build/release/CMakeFiles/CMakeTmp'
make[1]: *** [Makefile:121: cmTC_fc5c3/fast] Error 2
make[1]: Leaving directory '/home/vagrant/slave/monero-static-win64/build/build/release/CMakeFiles/CMakeTmp'


Determining if the function strlcpy exists failed with the following output:
Change Dir: C:/msys64/home/vagrant/slave/monero-static-win64/build/build/release/CMakeFiles/CMakeTmp

Run Build Command:"C:/msys64/usr/bin/make.exe" "cmTC_d48f7/fast"
make[1]: Entering directory '/home/vagrant/slave/monero-static-win64/build/build/release/CMakeFiles/CMakeTmp'
/usr/bin/make -f CMakeFiles/cmTC_d48f7.dir/build.make CMakeFiles/cmTC_d48f7.dir/build
make[2]: Entering directory '/home/vagrant/slave/monero-static-win64/build/build/release/CMakeFiles/CMakeTmp'
Building C object CMakeFiles/cmTC_d48f7.dir/CheckFunctionExists.c.obj

/C/msys64/mingw64/bin/x86_64-w64-mingw32-gcc.exe   -DCHECK_FUNCTION_EXISTS=strlcpy   -o CMakeFiles/cmTC_d48f7.dir/CheckFunctionExists.c.obj   -c /C/msys64/mingw64/share/cmake-3.12/Modules/CheckFunctionExists.c
Linking C executable cmTC_d48f7.exe

/C/msys64/mingw64/bin/cmake.exe -E remove -f CMakeFiles/cmTC_d48f7.dir/objects.a
ar cr CMakeFiles/cmTC_d48f7.dir/objects.a "CMakeFiles/cmTC_d48f7.dir/CheckFunctionExists.c.obj" 
/C/msys64/mingw64/bin/x86_64-w64-mingw32-gcc.exe  -DCHECK_FUNCTION_EXISTS=strlcpy    -Wl,--whole-archive CMakeFiles/cmTC_d48f7.dir/objects.a -Wl,--no-whole-archive  -o cmTC_d48f7.exe -Wl,--major-image-version,0,--minor-image-version,0 -liphlpapi -lws2_32 -lkernel32 -luser32 -lgdi32 -lwinspool -lshell32 -lole32 -loleaut32 -luuid -lcomdlg32 -ladvapi32 
CMakeFiles/cmTC_d48f7.dir/objects.a(CheckFunctionExists.c.obj):CheckFunctionExists.c:(.text+0x15): undefined reference to `strlcpy'

collect2.exe: error: ld returned 1 exit status
make[2]: *** [CMakeFiles/cmTC_d48f7.dir/build.make:88: cmTC_d48f7.exe] Error 1
make[2]: Leaving directory '/home/vagrant/slave/monero-static-win64/build/build/release/CMakeFiles/CMakeTmp'
make[1]: *** [Makefile:121: cmTC_d48f7/fast] Error 2
make[1]: Leaving directory '/home/vagrant/slave/monero-static-win64/build/build/release/CMakeFiles/CMakeTmp'


Determining if the function strptime exists failed with the following output:
Change Dir: C:/msys64/home/vagrant/slave/monero-static-win64/build/build/release/CMakeFiles/CMakeTmp

Run Build Command:"C:/msys64/usr/bin/make.exe" "cmTC_33a66/fast"
make[1]: Entering directory '/home/vagrant/slave/monero-static-win64/build/build/release/CMakeFiles/CMakeTmp'
/usr/bin/make -f CMakeFiles/cmTC_33a66.dir/build.make CMakeFiles/cmTC_33a66.dir/build
make[2]: Entering directory '/home/vagrant/slave/monero-static-win64/build/build/release/CMakeFiles/CMakeTmp'
Building C object CMakeFiles/cmTC_33a66.dir/CheckFunctionExists.c.obj

/C/msys64/mingw64/bin/x86_64-w64-mingw32-gcc.exe   -DCHECK_FUNCTION_EXISTS=strptime   -o CMakeFiles/cmTC_33a66.dir/CheckFunctionExists.c.obj   -c /C/msys64/mingw64/share/cmake-3.12/Modules/CheckFunctionExists.c
Linking C executable cmTC_33a66.exe

/C/msys64/mingw64/bin/cmake.exe -E remove -f CMakeFiles/cmTC_33a66.dir/objects.a
ar cr CMakeFiles/cmTC_33a66.dir/objects.a "CMakeFiles/cmTC_33a66.dir/CheckFunctionExists.c.obj" 
/C/msys64/mingw64/bin/x86_64-w64-mingw32-gcc.exe  -DCHECK_FUNCTION_EXISTS=strptime    -Wl,--whole-archive CMakeFiles/cmTC_33a66.dir/objects.a -Wl,--no-whole-archive  -o cmTC_33a66.exe -Wl,--major-image-version,0,--minor-image-version,0 -liphlpapi -lws2_32 -lkernel32 -luser32 -lgdi32 -lwinspool -lshell32 -lole32 -loleaut32 -luuid -lcomdlg32 -ladvapi32 
CMakeFiles/cmTC_33a66.dir/objects.a(CheckFunctionExists.c.obj):CheckFunctionExists.c:(.text+0x15): undefined reference to `strptime'

collect2.exe: error: ld returned 1 exit status
make[2]: *** [CMakeFiles/cmTC_33a66.dir/build.make:88: cmTC_33a66.exe] Error 1
make[2]: Leaving directory '/home/vagrant/slave/monero-static-win64/build/build/release/CMakeFiles/CMakeTmp'
make[1]: *** [Makefile:121: cmTC_33a66/fast] Error 2
make[1]: Leaving directory '/home/vagrant/slave/monero-static-win64/build/build/release/CMakeFiles/CMakeTmp'


Determining if the function writev exists failed with the following output:
Change Dir: C:/msys64/home/vagrant/slave/monero-static-win64/build/build/release/CMakeFiles/CMakeTmp

Run Build Command:"C:/msys64/usr/bin/make.exe" "cmTC_5b509/fast"
make[1]: Entering directory '/home/vagrant/slave/monero-static-win64/build/build/release/CMakeFiles/CMakeTmp'
/usr/bin/make -f CMakeFiles/cmTC_5b509.dir/build.make CMakeFiles/cmTC_5b509.dir/build
make[2]: Entering directory '/home/vagrant/slave/monero-static-win64/build/build/release/CMakeFiles/CMakeTmp'
Building C object CMakeFiles/cmTC_5b509.dir/CheckFunctionExists.c.obj

/C/msys64/mingw64/bin/x86_64-w64-mingw32-gcc.exe   -DCHECK_FUNCTION_EXISTS=writev   -o CMakeFiles/cmTC_5b509.dir/CheckFunctionExists.c.obj   -c /C/msys64/mingw64/share/cmake-3.12/Modules/CheckFunctionExists.c
Linking C executable cmTC_5b509.exe

/C/msys64/mingw64/bin/cmake.exe -E remove -f CMakeFiles/cmTC_5b509.dir/objects.a
ar cr CMakeFiles/cmTC_5b509.dir/objects.a "CMakeFiles/cmTC_5b509.dir/CheckFunctionExists.c.obj" 
/C/msys64/mingw64/bin/x86_64-w64-mingw32-gcc.exe  -DCHECK_FUNCTION_EXISTS=writev    -Wl,--whole-archive CMakeFiles/cmTC_5b509.dir/objects.a -Wl,--no-whole-archive  -o cmTC_5b509.exe -Wl,--major-image-version,0,--minor-image-version,0 -liphlpapi -lws2_32 -lkernel32 -luser32 -lgdi32 -lwinspool -lshell32 -lole32 -loleaut32 -luuid -lcomdlg32 -ladvapi32 
CMakeFiles/cmTC_5b509.dir/objects.a(CheckFunctionExists.c.obj):CheckFunctionExists.c:(.text+0x15): undefined reference to `writev'

collect2.exe: error: ld returned 1 exit status
make[2]: *** [CMakeFiles/cmTC_5b509.dir/build.make:88: cmTC_5b509.exe] Error 1
make[2]: Leaving directory '/home/vagrant/slave/monero-static-win64/build/build/release/CMakeFiles/CMakeTmp'
make[1]: *** [Makefile:121: cmTC_5b509/fast] Error 2
make[1]: Leaving directory '/home/vagrant/slave/monero-static-win64/build/build/release/CMakeFiles/CMakeTmp'


Determining size of gid_t failed with the following output:
Change Dir: C:/msys64/home/vagrant/slave/monero-static-win64/build/build/release/CMakeFiles/CMakeTmp

Run Build Command:"C:/msys64/usr/bin/make.exe" "cmTC_6de06/fast"
make[1]: Entering directory '/home/vagrant/slave/monero-static-win64/build/build/release/CMakeFiles/CMakeTmp'
/usr/bin/make -f CMakeFiles/cmTC_6de06.dir/build.make CMakeFiles/cmTC_6de06.dir/build
make[2]: Entering directory '/home/vagrant/slave/monero-static-win64/build/build/release/CMakeFiles/CMakeTmp'
Building C object CMakeFiles/cmTC_6de06.dir/gid_t.c.obj

/C/msys64/mingw64/bin/x86_64-w64-mingw32-gcc.exe    -o CMakeFiles/cmTC_6de06.dir/gid_t.c.obj   -c /C/msys64/home/vagrant/slave/monero-static-win64/build/build/release/CMakeFiles/CheckTypeSize/gid_t.c
C:/msys64/home/vagrant/slave/monero-static-win64/build/build/release/CMakeFiles/CheckTypeSize/gid_t.c:24:22: error: 'gid_t' undeclared here (not in a function); did you mean 'pid_t'?
 #define SIZE (sizeof(gid_t))
                      ^~~~~
C:/msys64/home/vagrant/slave/monero-static-win64/build/build/release/CMakeFiles/CheckTypeSize/gid_t.c:26:12: note: in expansion of macro 'SIZE'
   ('0' + ((SIZE / 10000)%10)),
            ^~~~
make[2]: *** [CMakeFiles/cmTC_6de06.dir/build.make:66: CMakeFiles/cmTC_6de06.dir/gid_t.c.obj] Error 1
make[2]: Leaving directory '/home/vagrant/slave/monero-static-win64/build/build/release/CMakeFiles/CMakeTmp'
make[1]: *** [Makefile:121: cmTC_6de06/fast] Error 2
make[1]: Leaving directory '/home/vagrant/slave/monero-static-win64/build/build/release/CMakeFiles/CMakeTmp'

C:/msys64/home/vagrant/slave/monero-static-win64/build/build/release/CMakeFiles/CheckTypeSize/gid_t.c:
#include <sys/types.h>
#include <stdint.h>
#include <stddef.h>
#include "sys/types.h"


#undef KEY
#if defined(__i386)
# define KEY '_','_','i','3','8','6'
#elif defined(__x86_64)
# define KEY '_','_','x','8','6','_','6','4'
#elif defined(__ppc__)
# define KEY '_','_','p','p','c','_','_'
#elif defined(__ppc64__)
# define KEY '_','_','p','p','c','6','4','_','_'
#elif defined(__aarch64__)
# define KEY '_','_','a','a','r','c','h','6','4','_','_'
#elif defined(__ARM_ARCH_7A__)
# define KEY '_','_','A','R','M','_','A','R','C','H','_','7','A','_','_'
#elif defined(__ARM_ARCH_7S__)
# define KEY '_','_','A','R','M','_','A','R','C','H','_','7','S','_','_'
#endif

#define SIZE (sizeof(gid_t))
char info_size[] =  {'I', 'N', 'F', 'O', ':', 's','i','z','e','[',
  ('0' + ((SIZE / 10000)%10)),
  ('0' + ((SIZE / 1000)%10)),
  ('0' + ((SIZE / 100)%10)),
  ('0' + ((SIZE / 10)%10)),
  ('0' +  (SIZE    % 10)),
  ']',
#ifdef KEY
  ' ','k','e','y','[', KEY, ']',
#endif
  '\0'};

#ifdef __CLASSIC_C__
int main(argc, argv) int argc; char *argv[];
#else
int main(int argc, char *argv[])
#endif
{
  int require = 0;
  require += info_size[argc];
  (void)argv;
  return require;
}


Determining size of in_addr_t failed with the following output:
Change Dir: C:/msys64/home/vagrant/slave/monero-static-win64/build/build/release/CMakeFiles/CMakeTmp

Run Build Command:"C:/msys64/usr/bin/make.exe" "cmTC_f1be3/fast"
make[1]: Entering directory '/home/vagrant/slave/monero-static-win64/build/build/release/CMakeFiles/CMakeTmp'
/usr/bin/make -f CMakeFiles/cmTC_f1be3.dir/build.make CMakeFiles/cmTC_f1be3.dir/build
make[2]: Entering directory '/home/vagrant/slave/monero-static-win64/build/build/release/CMakeFiles/CMakeTmp'
Building C object CMakeFiles/cmTC_f1be3.dir/in_addr_t.c.obj

/C/msys64/mingw64/bin/x86_64-w64-mingw32-gcc.exe    -o CMakeFiles/cmTC_f1be3.dir/in_addr_t.c.obj   -c /C/msys64/home/vagrant/slave/monero-static-win64/build/build/release/CMakeFiles/CheckTypeSize/in_addr_t.c
C:/msys64/home/vagrant/slave/monero-static-win64/build/build/release/CMakeFiles/CheckTypeSize/in_addr_t.c:4:10: fatal error: netinet/in.h: No such file or directory
 #include "netinet/in.h"
          ^~~~~~~~~~~~~~
compilation terminated.

make[2]: *** [CMakeFiles/cmTC_f1be3.dir/build.make:66: CMakeFiles/cmTC_f1be3.dir/in_addr_t.c.obj] Error 1
make[2]: Leaving directory '/home/vagrant/slave/monero-static-win64/build/build/release/CMakeFiles/CMakeTmp'
make[1]: *** [Makefile:121: cmTC_f1be3/fast] Error 2
make[1]: Leaving directory '/home/vagrant/slave/monero-static-win64/build/build/release/CMakeFiles/CMakeTmp'

C:/msys64/home/vagrant/slave/monero-static-win64/build/build/release/CMakeFiles/CheckTypeSize/in_addr_t.c:
#include <sys/types.h>
#include <stdint.h>
#include <stddef.h>
#include "netinet/in.h"


#undef KEY
#if defined(__i386)
# define KEY '_','_','i','3','8','6'
#elif defined(__x86_64)
# define KEY '_','_','x','8','6','_','6','4'
#elif defined(__ppc__)
# define KEY '_','_','p','p','c','_','_'
#elif defined(__ppc64__)
# define KEY '_','_','p','p','c','6','4','_','_'
#elif defined(__aarch64__)
# define KEY '_','_','a','a','r','c','h','6','4','_','_'
#elif defined(__ARM_ARCH_7A__)
# define KEY '_','_','A','R','M','_','A','R','C','H','_','7','A','_','_'
#elif defined(__ARM_ARCH_7S__)
# define KEY '_','_','A','R','M','_','A','R','C','H','_','7','S','_','_'
#endif

#define SIZE (sizeof(in_addr_t))
char info_size[] =  {'I', 'N', 'F', 'O', ':', 's','i','z','e','[',
  ('0' + ((SIZE / 10000)%10)),
  ('0' + ((SIZE / 1000)%10)),
  ('0' + ((SIZE / 100)%10)),
  ('0' + ((SIZE / 10)%10)),
  ('0' +  (SIZE    % 10)),
  ']',
#ifdef KEY
  ' ','k','e','y','[', KEY, ']',
#endif
  '\0'};

#ifdef __CLASSIC_C__
int main(argc, argv) int argc; char *argv[];
#else
int main(int argc, char *argv[])
#endif
{
  int require = 0;
  require += info_size[argc];
  (void)argv;
  return require;
}


Determining size of in_port_t failed with the following output:
Change Dir: C:/msys64/home/vagrant/slave/monero-static-win64/build/build/release/CMakeFiles/CMakeTmp

Run Build Command:"C:/msys64/usr/bin/make.exe" "cmTC_7c2c1/fast"
make[1]: Entering directory '/home/vagrant/slave/monero-static-win64/build/build/release/CMakeFiles/CMakeTmp'
/usr/bin/make -f CMakeFiles/cmTC_7c2c1.dir/build.make CMakeFiles/cmTC_7c2c1.dir/build
make[2]: Entering directory '/home/vagrant/slave/monero-static-win64/build/build/release/CMakeFiles/CMakeTmp'
Building C object CMakeFiles/cmTC_7c2c1.dir/in_port_t.c.obj

/C/msys64/mingw64/bin/x86_64-w64-mingw32-gcc.exe    -o CMakeFiles/cmTC_7c2c1.dir/in_port_t.c.obj   -c /C/msys64/home/vagrant/slave/monero-static-win64/build/build/release/CMakeFiles/CheckTypeSize/in_port_t.c
C:/msys64/home/vagrant/slave/monero-static-win64/build/build/release/CMakeFiles/CheckTypeSize/in_port_t.c:4:10: fatal error: netinet/in.h: No such file or directory
 #include "netinet/in.h"
          ^~~~~~~~~~~~~~
compilation terminated.

make[2]: *** [CMakeFiles/cmTC_7c2c1.dir/build.make:66: CMakeFiles/cmTC_7c2c1.dir/in_port_t.c.obj] Error 1
make[2]: Leaving directory '/home/vagrant/slave/monero-static-win64/build/build/release/CMakeFiles/CMakeTmp'
make[1]: *** [Makefile:121: cmTC_7c2c1/fast] Error 2
make[1]: Leaving directory '/home/vagrant/slave/monero-static-win64/build/build/release/CMakeFiles/CMakeTmp'

C:/msys64/home/vagrant/slave/monero-static-win64/build/build/release/CMakeFiles/CheckTypeSize/in_port_t.c:
#include <sys/types.h>
#include <stdint.h>
#include <stddef.h>
#include "netinet/in.h"


#undef KEY
#if defined(__i386)
# define KEY '_','_','i','3','8','6'
#elif defined(__x86_64)
# define KEY '_','_','x','8','6','_','6','4'
#elif defined(__ppc__)
# define KEY '_','_','p','p','c','_','_'
#elif defined(__ppc64__)
# define KEY '_','_','p','p','c','6','4','_','_'
#elif defined(__aarch64__)
# define KEY '_','_','a','a','r','c','h','6','4','_','_'
#elif defined(__ARM_ARCH_7A__)
# define KEY '_','_','A','R','M','_','A','R','C','H','_','7','A','_','_'
#elif defined(__ARM_ARCH_7S__)
# define KEY '_','_','A','R','M','_','A','R','C','H','_','7','S','_','_'
#endif

#define SIZE (sizeof(in_port_t))
char info_size[] =  {'I', 'N', 'F', 'O', ':', 's','i','z','e','[',
  ('0' + ((SIZE / 10000)%10)),
  ('0' + ((SIZE / 1000)%10)),
  ('0' + ((SIZE / 100)%10)),
  ('0' + ((SIZE / 10)%10)),
  ('0' +  (SIZE    % 10)),
  ']',
#ifdef KEY
  ' ','k','e','y','[', KEY, ']',
#endif
  '\0'};

#ifdef __CLASSIC_C__
int main(argc, argv) int argc; char *argv[];
#else
int main(int argc, char *argv[])
#endif
{
  int require = 0;
  require += info_size[argc];
  (void)argv;
  return require;
}


Determining size of rlim_t failed with the following output:
Change Dir: C:/msys64/home/vagrant/slave/monero-static-win64/build/build/release/CMakeFiles/CMakeTmp

Run Build Command:"C:/msys64/usr/bin/make.exe" "cmTC_700d1/fast"
make[1]: Entering directory '/home/vagrant/slave/monero-static-win64/build/build/release/CMakeFiles/CMakeTmp'
/usr/bin/make -f CMakeFiles/cmTC_700d1.dir/build.make CMakeFiles/cmTC_700d1.dir/build
make[2]: Entering directory '/home/vagrant/slave/monero-static-win64/build/build/release/CMakeFiles/CMakeTmp'
Building C object CMakeFiles/cmTC_700d1.dir/rlim_t.c.obj

/C/msys64/mingw64/bin/x86_64-w64-mingw32-gcc.exe    -o CMakeFiles/cmTC_700d1.dir/rlim_t.c.obj   -c /C/msys64/home/vagrant/slave/monero-static-win64/build/build/release/CMakeFiles/CheckTypeSize/rlim_t.c
C:/msys64/home/vagrant/slave/monero-static-win64/build/build/release/CMakeFiles/CheckTypeSize/rlim_t.c:4:10: fatal error: sys/resource.h: No such file or directory
 #include "sys/resource.h"
          ^~~~~~~~~~~~~~~~
compilation terminated.

make[2]: *** [CMakeFiles/cmTC_700d1.dir/build.make:66: CMakeFiles/cmTC_700d1.dir/rlim_t.c.obj] Error 1
make[2]: Leaving directory '/home/vagrant/slave/monero-static-win64/build/build/release/CMakeFiles/CMakeTmp'
make[1]: *** [Makefile:121: cmTC_700d1/fast] Error 2
make[1]: Leaving directory '/home/vagrant/slave/monero-static-win64/build/build/release/CMakeFiles/CMakeTmp'

C:/msys64/home/vagrant/slave/monero-static-win64/build/build/release/CMakeFiles/CheckTypeSize/rlim_t.c:
#include <sys/types.h>
#include <stdint.h>
#include <stddef.h>
#include "sys/resource.h"


#undef KEY
#if defined(__i386)
# define KEY '_','_','i','3','8','6'
#elif defined(__x86_64)
# define KEY '_','_','x','8','6','_','6','4'
#elif defined(__ppc__)
# define KEY '_','_','p','p','c','_','_'
#elif defined(__ppc64__)
# define KEY '_','_','p','p','c','6','4','_','_'
#elif defined(__aarch64__)
# define KEY '_','_','a','a','r','c','h','6','4','_','_'
#elif defined(__ARM_ARCH_7A__)
# define KEY '_','_','A','R','M','_','A','R','C','H','_','7','A','_','_'
#elif defined(__ARM_ARCH_7S__)
# define KEY '_','_','A','R','M','_','A','R','C','H','_','7','S','_','_'
#endif

#define SIZE (sizeof(rlim_t))
char info_size[] =  {'I', 'N', 'F', 'O', ':', 's','i','z','e','[',
  ('0' + ((SIZE / 10000)%10)),
  ('0' + ((SIZE / 1000)%10)),
  ('0' + ((SIZE / 100)%10)),
  ('0' + ((SIZE / 10)%10)),
  ('0' +  (SIZE    % 10)),
  ']',
#ifdef KEY
  ' ','k','e','y','[', KEY, ']',
#endif
  '\0'};

#ifdef __CLASSIC_C__
int main(argc, argv) int argc; char *argv[];
#else
int main(int argc, char *argv[])
#endif
{
  int require = 0;
  require += info_size[argc];
  (void)argv;
  return require;
}


Determining size of uid_t failed with the following output:
Change Dir: C:/msys64/home/vagrant/slave/monero-static-win64/build/build/release/CMakeFiles/CMakeTmp

Run Build Command:"C:/msys64/usr/bin/make.exe" "cmTC_eb674/fast"
make[1]: Entering directory '/home/vagrant/slave/monero-static-win64/build/build/release/CMakeFiles/CMakeTmp'
/usr/bin/make -f CMakeFiles/cmTC_eb674.dir/build.make CMakeFiles/cmTC_eb674.dir/build
make[2]: Entering directory '/home/vagrant/slave/monero-static-win64/build/build/release/CMakeFiles/CMakeTmp'
Building C object CMakeFiles/cmTC_eb674.dir/uid_t.c.obj

/C/msys64/mingw64/bin/x86_64-w64-mingw32-gcc.exe    -o CMakeFiles/cmTC_eb674.dir/uid_t.c.obj   -c /C/msys64/home/vagrant/slave/monero-static-win64/build/build/release/CMakeFiles/CheckTypeSize/uid_t.c
C:/msys64/home/vagrant/slave/monero-static-win64/build/build/release/CMakeFiles/CheckTypeSize/uid_t.c:24:22: error: 'uid_t' undeclared here (not in a function); did you mean 'pid_t'?
 #define SIZE (sizeof(uid_t))
                      ^~~~~
C:/msys64/home/vagrant/slave/monero-static-win64/build/build/release/CMakeFiles/CheckTypeSize/uid_t.c:26:12: note: in expansion of macro 'SIZE'
   ('0' + ((SIZE / 10000)%10)),
            ^~~~
make[2]: *** [CMakeFiles/cmTC_eb674.dir/build.make:66: CMakeFiles/cmTC_eb674.dir/uid_t.c.obj] Error 1
make[2]: Leaving directory '/home/vagrant/slave/monero-static-win64/build/build/release/CMakeFiles/CMakeTmp'
make[1]: *** [Makefile:121: cmTC_eb674/fast] Error 2
make[1]: Leaving directory '/home/vagrant/slave/monero-static-win64/build/build/release/CMakeFiles/CMakeTmp'

C:/msys64/home/vagrant/slave/monero-static-win64/build/build/release/CMakeFiles/CheckTypeSize/uid_t.c:
#include <sys/types.h>
#include <stdint.h>
#include <stddef.h>
#include "sys/types.h"


#undef KEY
#if defined(__i386)
# define KEY '_','_','i','3','8','6'
#elif defined(__x86_64)
# define KEY '_','_','x','8','6','_','6','4'
#elif defined(__ppc__)
# define KEY '_','_','p','p','c','_','_'
#elif defined(__ppc64__)
# define KEY '_','_','p','p','c','6','4','_','_'
#elif defined(__aarch64__)
# define KEY '_','_','a','a','r','c','h','6','4','_','_'
#elif defined(__ARM_ARCH_7A__)
# define KEY '_','_','A','R','M','_','A','R','C','H','_','7','A','_','_'
#elif defined(__ARM_ARCH_7S__)
# define KEY '_','_','A','R','M','_','A','R','C','H','_','7','S','_','_'
#endif

#define SIZE (sizeof(uid_t))
char info_size[] =  {'I', 'N', 'F', 'O', ':', 's','i','z','e','[',
  ('0' + ((SIZE / 10000)%10)),
  ('0' + ((SIZE / 1000)%10)),
  ('0' + ((SIZE / 100)%10)),
  ('0' + ((SIZE / 10)%10)),
  ('0' +  (SIZE    % 10)),
  ']',
#ifdef KEY
  ' ','k','e','y','[', KEY, ']',
#endif
  '\0'};

#ifdef __CLASSIC_C__
int main(argc, argv) int argc; char *argv[];
#else
int main(int argc, char *argv[])
#endif
{
  int require = 0;
  require += info_size[argc];
  (void)argv;
  return require;
}


Determining if the pthread_rwlock_t exist failed with the following output:
Change Dir: C:/msys64/home/vagrant/slave/monero-static-win64/build/build/release/CMakeFiles/CMakeTmp

Run Build Command:"C:/msys64/usr/bin/make.exe" "cmTC_7cbda/fast"
make[1]: Entering directory '/home/vagrant/slave/monero-static-win64/build/build/release/CMakeFiles/CMakeTmp'
/usr/bin/make -f CMakeFiles/cmTC_7cbda.dir/build.make CMakeFiles/cmTC_7cbda.dir/build
make[2]: Entering directory '/home/vagrant/slave/monero-static-win64/build/build/release/CMakeFiles/CMakeTmp'
Building C object CMakeFiles/cmTC_7cbda.dir/CheckSymbolExists.c.obj

/C/msys64/mingw64/bin/x86_64-w64-mingw32-gcc.exe    -o CMakeFiles/cmTC_7cbda.dir/CheckSymbolExists.c.obj   -c /C/msys64/home/vagrant/slave/monero-static-win64/build/build/release/CMakeFiles/CMakeTmp/CheckSymbolExists.c
C:/msys64/home/vagrant/slave/monero-static-win64/build/build/release/CMakeFiles/CMakeTmp/CheckSymbolExists.c: In function 'main':
C:/msys64/home/vagrant/slave/monero-static-win64/build/build/release/CMakeFiles/CMakeTmp/CheckSymbolExists.c:8:19: error: expected expression before 'pthread_rwlock_t'
   return ((int*)(&pthread_rwlock_t))[argc];
                   ^~~~~~~~~~~~~~~~
make[2]: *** [CMakeFiles/cmTC_7cbda.dir/build.make:66: CMakeFiles/cmTC_7cbda.dir/CheckSymbolExists.c.obj] Error 1
make[2]: Leaving directory '/home/vagrant/slave/monero-static-win64/build/build/release/CMakeFiles/CMakeTmp'
make[1]: *** [Makefile:121: cmTC_7cbda/fast] Error 2
make[1]: Leaving directory '/home/vagrant/slave/monero-static-win64/build/build/release/CMakeFiles/CMakeTmp'

File C:/msys64/home/vagrant/slave/monero-static-win64/build/build/release/CMakeFiles/CMakeTmp/CheckSymbolExists.c:
/* */
#include <pthread.h>

int main(int argc, char** argv)
{
  (void)argv;
#ifndef pthread_rwlock_t
  return ((int*)(&pthread_rwlock_t))[argc];
#else
  (void)argc;
  return 0;
#endif
}

Determining if the pthread_spinlock_t exist failed with the following output:
Change Dir: C:/msys64/home/vagrant/slave/monero-static-win64/build/build/release/CMakeFiles/CMakeTmp

Run Build Command:"C:/msys64/usr/bin/make.exe" "cmTC_1700c/fast"
make[1]: Entering directory '/home/vagrant/slave/monero-static-win64/build/build/release/CMakeFiles/CMakeTmp'
/usr/bin/make -f CMakeFiles/cmTC_1700c.dir/build.make CMakeFiles/cmTC_1700c.dir/build
make[2]: Entering directory '/home/vagrant/slave/monero-static-win64/build/build/release/CMakeFiles/CMakeTmp'
Building C object CMakeFiles/cmTC_1700c.dir/CheckSymbolExists.c.obj

/C/msys64/mingw64/bin/x86_64-w64-mingw32-gcc.exe    -o CMakeFiles/cmTC_1700c.dir/CheckSymbolExists.c.obj   -c /C/msys64/home/vagrant/slave/monero-static-win64/build/build/release/CMakeFiles/CMakeTmp/CheckSymbolExists.c
C:/msys64/home/vagrant/slave/monero-static-win64/build/build/release/CMakeFiles/CMakeTmp/CheckSymbolExists.c: In function 'main':
C:/msys64/home/vagrant/slave/monero-static-win64/build/build/release/CMakeFiles/CMakeTmp/CheckSymbolExists.c:8:19: error: expected expression before 'pthread_spinlock_t'
   return ((int*)(&pthread_spinlock_t))[argc];
                   ^~~~~~~~~~~~~~~~~~
make[2]: *** [CMakeFiles/cmTC_1700c.dir/build.make:66: CMakeFiles/cmTC_1700c.dir/CheckSymbolExists.c.obj] Error 1
make[2]: Leaving directory '/home/vagrant/slave/monero-static-win64/build/build/release/CMakeFiles/CMakeTmp'
make[1]: *** [Makefile:121: cmTC_1700c/fast] Error 2
make[1]: Leaving directory '/home/vagrant/slave/monero-static-win64/build/build/release/CMakeFiles/CMakeTmp'

File C:/msys64/home/vagrant/slave/monero-static-win64/build/build/release/CMakeFiles/CMakeTmp/CheckSymbolExists.c:
/* */
#include <pthread.h>

int main(int argc, char** argv)
{
  (void)argv;
#ifndef pthread_spinlock_t
  return ((int*)(&pthread_spinlock_t))[argc];
#else
  (void)argc;
  return 0;
#endif
}

Determining if the SSL_COMP_get_compression_methods exist failed with the following output:
Change Dir: C:/msys64/home/vagrant/slave/monero-static-win64/build/build/release/CMakeFiles/CMakeTmp

Run Build Command:"C:/msys64/usr/bin/make.exe" "cmTC_62de6/fast"
make[1]: Entering directory '/home/vagrant/slave/monero-static-win64/build/build/release/CMakeFiles/CMakeTmp'
/usr/bin/make -f CMakeFiles/cmTC_62de6.dir/build.make CMakeFiles/cmTC_62de6.dir/build
make[2]: Entering directory '/home/vagrant/slave/monero-static-win64/build/build/release/CMakeFiles/CMakeTmp'
Building C object CMakeFiles/cmTC_62de6.dir/CheckSymbolExists.c.obj

/C/msys64/mingw64/bin/x86_64-w64-mingw32-gcc.exe  -I/C/msys64/mingw64/include   -o CMakeFiles/cmTC_62de6.dir/CheckSymbolExists.c.obj   -c /C/msys64/home/vagrant/slave/monero-static-win64/build/build/release/CMakeFiles/CMakeTmp/CheckSymbolExists.c
Linking C executable cmTC_62de6.exe

/C/msys64/mingw64/bin/cmake.exe -E remove -f CMakeFiles/cmTC_62de6.dir/objects.a
ar cr CMakeFiles/cmTC_62de6.dir/objects.a "CMakeFiles/cmTC_62de6.dir/CheckSymbolExists.c.obj" 
/C/msys64/mingw64/bin/x86_64-w64-mingw32-gcc.exe      -Wl,--whole-archive CMakeFiles/cmTC_62de6.dir/objects.a -Wl,--no-whole-archive  -o cmTC_62de6.exe -Wl,--major-image-version,0,--minor-image-version,0 /C/msys64/mingw64/lib/libssl.a /C/msys64/mingw64/lib/libcrypto.a -lkernel32 -luser32 -lgdi32 -lwinspool -lshell32 -lole32 -loleaut32 -luuid -lcomdlg32 -ladvapi32 
C:/msys64/mingw64/lib/libcrypto.a(bss_sock.o):bss_sock.c:(.text+0x115): undefined reference to `__imp_shutdown'

C:/msys64/mingw64/lib/libcrypto.a(bss_sock.o):bss_sock.c:(.text+0x11f): undefined reference to `__imp_closesocket'

C:/msys64/mingw64/lib/libcrypto.a(bss_sock.o):bss_sock.c:(.text+0x19b): undefined reference to `__imp_shutdown'

C:/msys64/mingw64/lib/libcrypto.a(bss_sock.o):bss_sock.c:(.text+0x1a5): undefined reference to `__imp_closesocket'

C:/msys64/mingw64/lib/libcrypto.a(bss_sock.o):bss_sock.c:(.text+0x1c4): undefined reference to `__imp_WSASetLastError'

C:/msys64/mingw64/lib/libcrypto.a(bss_sock.o):bss_sock.c:(.text+0x1d7): undefined reference to `__imp_send'

C:/msys64/mingw64/lib/libcrypto.a(bss_sock.o):bss_sock.c:(.text+0x20a): undefined reference to `__imp_WSAGetLastError'

C:/msys64/mingw64/lib/libcrypto.a(bss_sock.o):bss_sock.c:(.text+0x27c): undefined reference to `__imp_WSASetLastError'

C:/msys64/mingw64/lib/libcrypto.a(bss_sock.o):bss_sock.c:(.text+0x28f): undefined reference to `__imp_recv'

C:/msys64/mingw64/lib/libcrypto.a(bss_sock.o):bss_sock.c:(.text+0x2bb): undefined reference to `__imp_WSAGetLastError'

C:/msys64/mingw64/lib/libcrypto.a(bss_sock.o):bss_sock.c:(.text+0x35f): undefined reference to `__imp_WSASetLastError'

C:/msys64/mingw64/lib/libcrypto.a(bss_sock.o):bss_sock.c:(.text+0x372): undefined reference to `__imp_send'

C:/msys64/mingw64/lib/libcrypto.a(bss_sock.o):bss_sock.c:(.text+0x3aa): undefined reference to `__imp_WSAGetLastError'

C:/msys64/mingw64/lib/libcrypto.a(bss_sock.o):bss_sock.c:(.text+0x465): undefined reference to `__imp_WSAGetLastError'

collect2.exe: error: ld returned 1 exit status
make[2]: *** [CMakeFiles/cmTC_62de6.dir/build.make:90: cmTC_62de6.exe] Error 1
make[2]: Leaving directory '/home/vagrant/slave/monero-static-win64/build/build/release/CMakeFiles/CMakeTmp'
make[1]: *** [Makefile:121: cmTC_62de6/fast] Error 2
make[1]: Leaving directory '/home/vagrant/slave/monero-static-win64/build/build/release/CMakeFiles/CMakeTmp'

File C:/msys64/home/vagrant/slave/monero-static-win64/build/build/release/CMakeFiles/CMakeTmp/CheckSymbolExists.c:
/* */
#include <openssl/ssl.h>

int main(int argc, char** argv)
{
  (void)argv;
#ifndef SSL_COMP_get_compression_methods
  return ((int*)(&SSL_COMP_get_compression_methods))[argc];
#else
  (void)argc;
  return 0;
#endif
}

Determining if the function EVP_MD_CTX_new exists failed with the following output:
Change Dir: C:/msys64/home/vagrant/slave/monero-static-win64/build/build/release/CMakeFiles/CMakeTmp

Run Build Command:"C:/msys64/usr/bin/make.exe" "cmTC_97878/fast"
make[1]: Entering directory '/home/vagrant/slave/monero-static-win64/build/build/release/CMakeFiles/CMakeTmp'
/usr/bin/make -f CMakeFiles/cmTC_97878.dir/build.make CMakeFiles/cmTC_97878.dir/build
make[2]: Entering directory '/home/vagrant/slave/monero-static-win64/build/build/release/CMakeFiles/CMakeTmp'
Building C object CMakeFiles/cmTC_97878.dir/CheckFunctionExists.c.obj

/C/msys64/mingw64/bin/x86_64-w64-mingw32-gcc.exe  -I/C/msys64/mingw64/include  -DCHECK_FUNCTION_EXISTS=EVP_MD_CTX_new   -o CMakeFiles/cmTC_97878.dir/CheckFunctionExists.c.obj   -c /C/msys64/mingw64/share/cmake-3.12/Modules/CheckFunctionExists.c
Linking C executable cmTC_97878.exe

/C/msys64/mingw64/bin/cmake.exe -E remove -f CMakeFiles/cmTC_97878.dir/objects.a
ar cr CMakeFiles/cmTC_97878.dir/objects.a "CMakeFiles/cmTC_97878.dir/CheckFunctionExists.c.obj" 
/C/msys64/mingw64/bin/x86_64-w64-mingw32-gcc.exe  -DCHECK_FUNCTION_EXISTS=EVP_MD_CTX_new    -Wl,--whole-archive CMakeFiles/cmTC_97878.dir/objects.a -Wl,--no-whole-archive  -o cmTC_97878.exe -Wl,--major-image-version,0,--minor-image-version,0 /C/msys64/mingw64/lib/libssl.a /C/msys64/mingw64/lib/libcrypto.a -lkernel32 -luser32 -lgdi32 -lwinspool -lshell32 -lole32 -loleaut32 -luuid -lcomdlg32 -ladvapi32 
CMakeFiles/cmTC_97878.dir/objects.a(CheckFunctionExists.c.obj):CheckFunctionExists.c:(.text+0x15): undefined reference to `EVP_MD_CTX_new'

collect2.exe: error: ld returned 1 exit status
make[2]: *** [CMakeFiles/cmTC_97878.dir/build.make:90: cmTC_97878.exe] Error 1
make[2]: Leaving directory '/home/vagrant/slave/monero-static-win64/build/build/release/CMakeFiles/CMakeTmp'
make[1]: *** [Makefile:121: cmTC_97878/fast] Error 2
make[1]: Leaving directory '/home/vagrant/slave/monero-static-win64/build/build/release/CMakeFiles/CMakeTmp'


Determining if the function OPENSSL_config exists failed with the following output:
Change Dir: C:/msys64/home/vagrant/slave/monero-static-win64/build/build/release/CMakeFiles/CMakeTmp

Run Build Command:"C:/msys64/usr/bin/make.exe" "cmTC_9c4ba/fast"
make[1]: Entering directory '/home/vagrant/slave/monero-static-win64/build/build/release/CMakeFiles/CMakeTmp'
/usr/bin/make -f CMakeFiles/cmTC_9c4ba.dir/build.make CMakeFiles/cmTC_9c4ba.dir/build
make[2]: Entering directory '/home/vagrant/slave/monero-static-win64/build/build/release/CMakeFiles/CMakeTmp'
Building C object CMakeFiles/cmTC_9c4ba.dir/CheckFunctionExists.c.obj

/C/msys64/mingw64/bin/x86_64-w64-mingw32-gcc.exe  -I/C/msys64/mingw64/include  -DCHECK_FUNCTION_EXISTS=OPENSSL_config   -o CMakeFiles/cmTC_9c4ba.dir/CheckFunctionExists.c.obj   -c /C/msys64/mingw64/share/cmake-3.12/Modules/CheckFunctionExists.c
Linking C executable cmTC_9c4ba.exe

/C/msys64/mingw64/bin/cmake.exe -E remove -f CMakeFiles/cmTC_9c4ba.dir/objects.a
ar cr CMakeFiles/cmTC_9c4ba.dir/objects.a "CMakeFiles/cmTC_9c4ba.dir/CheckFunctionExists.c.obj" 
/C/msys64/mingw64/bin/x86_64-w64-mingw32-gcc.exe  -DCHECK_FUNCTION_EXISTS=OPENSSL_config    -Wl,--whole-archive CMakeFiles/cmTC_9c4ba.dir/objects.a -Wl,--no-whole-archive  -o cmTC_9c4ba.exe -Wl,--major-image-version,0,--minor-image-version,0 /C/msys64/mingw64/lib/libssl.a /C/msys64/mingw64/lib/libcrypto.a -lkernel32 -luser32 -lgdi32 -lwinspool -lshell32 -lole32 -loleaut32 -luuid -lcomdlg32 -ladvapi32 
C:/msys64/mingw64/lib/libcrypto.a(e_capi.o):e_capi.c:(.text+0x19c): undefined reference to `__imp_CertFreeCertificateContext'

C:/msys64/mingw64/lib/libcrypto.a(e_capi.o):e_capi.c:(.text+0x20c): undefined reference to `__imp_CertFreeCertificateContext'

C:/msys64/mingw64/lib/libcrypto.a(e_capi.o):e_capi.c:(.text+0x433): undefined reference to `__imp_CertGetCertificateContextProperty'

C:/msys64/mingw64/lib/libcrypto.a(e_capi.o):e_capi.c:(.text+0x265e): undefined reference to `__imp_CertGetCertificateContextProperty'

C:/msys64/mingw64/lib/libcrypto.a(e_capi.o):e_capi.c:(.text+0x27c1): undefined reference to `__imp_CertGetCertificateContextProperty'

C:/msys64/mingw64/lib/libcrypto.a(e_capi.o):e_capi.c:(.text+0x2927): undefined reference to `__imp_CertEnumCertificatesInStore'

C:/msys64/mingw64/lib/libcrypto.a(e_capi.o):e_capi.c:(.text+0x29a6): undefined reference to `__imp_CertFindCertificateInStore'

C:/msys64/mingw64/lib/libcrypto.a(e_capi.o):e_capi.c:(.text+0x2c38): undefined reference to `__imp_CertOpenStore'

C:/msys64/mingw64/lib/libcrypto.a(e_capi.o):e_capi.c:(.text+0x2d78): undefined reference to `__imp_CertEnumCertificatesInStore'

C:/msys64/mingw64/lib/libcrypto.a(e_capi.o):e_capi.c:(.text+0x2e2d): undefined reference to `__imp_CertGetCertificateContextProperty'

C:/msys64/mingw64/lib/libcrypto.a(e_capi.o):e_capi.c:(.text+0x2e67): undefined reference to `__imp_CertGetCertificateContextProperty'

C:/msys64/mingw64/lib/libcrypto.a(e_capi.o):e_capi.c:(.text+0x2ea8): undefined reference to `__imp_CertDuplicateCertificateContext'

C:/msys64/mingw64/lib/libcrypto.a(e_capi.o):e_capi.c:(.text+0x2f07): undefined reference to `__imp_CertCloseStore'

C:/msys64/mingw64/lib/libcrypto.a(e_capi.o):e_capi.c:(.text+0x2f44): undefined reference to `__imp_CertFreeCertificateContext'

C:/msys64/mingw64/lib/libcrypto.a(e_capi.o):e_capi.c:(.text+0x315f): undefined reference to `__imp_CertOpenStore'

C:/msys64/mingw64/lib/libcrypto.a(e_capi.o):e_capi.c:(.text+0x31a4): undefined reference to `__imp_CertFreeCertificateContext'

C:/msys64/mingw64/lib/libcrypto.a(e_capi.o):e_capi.c:(.text+0x31af): undefined reference to `__imp_CertCloseStore'

C:/msys64/mingw64/lib/libcrypto.a(e_capi.o):e_capi.c:(.text+0x31c9): undefined reference to `__imp_CertEnumCertificatesInStore'

C:/msys64/mingw64/lib/libcrypto.a(e_capi.o):e_capi.c:(.text+0x37a6): undefined reference to `__imp_CertOpenStore'

C:/msys64/mingw64/lib/libcrypto.a(e_capi.o):e_capi.c:(.text+0x3806): undefined reference to `__imp_CertFreeCertificateContext'

C:/msys64/mingw64/lib/libcrypto.a(e_capi.o):e_capi.c:(.text+0x3811): undefined reference to `__imp_CertCloseStore'

C:/msys64/mingw64/lib/libcrypto.a(e_capi.o):e_capi.c:(.text+0x3930): undefined reference to `__imp_CertFreeCertificateContext'

C:/msys64/mingw64/lib/libcrypto.a(e_capi.o):e_capi.c:(.text+0x39bd): undefined reference to `__imp_CertFreeCertificateContext'

collect2.exe: error: ld returned 1 exit status
make[2]: *** [CMakeFiles/cmTC_9c4ba.dir/build.make:90: cmTC_9c4ba.exe] Error 1
make[2]: Leaving directory '/home/vagrant/slave/monero-static-win64/build/build/release/CMakeFiles/CMakeTmp'
make[1]: *** [Makefile:121: cmTC_9c4ba/fast] Error 2
make[1]: Leaving directory '/home/vagrant/slave/monero-static-win64/build/build/release/CMakeFiles/CMakeTmp'


Determining if the LIBRESSL_VERSION_TEXT exist failed with the following output:
Change Dir: C:/msys64/home/vagrant/slave/monero-static-win64/build/build/release/CMakeFiles/CMakeTmp

Run Build Command:"C:/msys64/usr/bin/make.exe" "cmTC_a0298/fast"
make[1]: Entering directory '/home/vagrant/slave/monero-static-win64/build/build/release/CMakeFiles/CMakeTmp'
/usr/bin/make -f CMakeFiles/cmTC_a0298.dir/build.make CMakeFiles/cmTC_a0298.dir/build
make[2]: Entering directory '/home/vagrant/slave/monero-static-win64/build/build/release/CMakeFiles/CMakeTmp'
Building C object CMakeFiles/cmTC_a0298.dir/CheckSymbolExists.c.obj

/C/msys64/mingw64/bin/x86_64-w64-mingw32-gcc.exe    -o CMakeFiles/cmTC_a0298.dir/CheckSymbolExists.c.obj   -c /C/msys64/home/vagrant/slave/monero-static-win64/build/build/release/CMakeFiles/CMakeTmp/CheckSymbolExists.c
C:/msys64/home/vagrant/slave/monero-static-win64/build/build/release/CMakeFiles/CMakeTmp/CheckSymbolExists.c: In function 'main':
C:/msys64/home/vagrant/slave/monero-static-win64/build/build/release/CMakeFiles/CMakeTmp/CheckSymbolExists.c:8:19: error: 'LIBRESSL_VERSION_TEXT' undeclared (first use in this function); did you mean 'OPENSSL_VERSION_TEXT'?
   return ((int*)(&LIBRESSL_VERSION_TEXT))[argc];
                   ^~~~~~~~~~~~~~~~~~~~~
                   OPENSSL_VERSION_TEXT
C:/msys64/home/vagrant/slave/monero-static-win64/build/build/release/CMakeFiles/CMakeTmp/CheckSymbolExists.c:8:19: note: each undeclared identifier is reported only once for each function it appears in
make[2]: *** [CMakeFiles/cmTC_a0298.dir/build.make:66: CMakeFiles/cmTC_a0298.dir/CheckSymbolExists.c.obj] Error 1
make[2]: Leaving directory '/home/vagrant/slave/monero-static-win64/build/build/release/CMakeFiles/CMakeTmp'
make[1]: *** [Makefile:121: cmTC_a0298/fast] Error 2
make[1]: Leaving directory '/home/vagrant/slave/monero-static-win64/build/build/release/CMakeFiles/CMakeTmp'

File C:/msys64/home/vagrant/slave/monero-static-win64/build/build/release/CMakeFiles/CMakeTmp/CheckSymbolExists.c:
/* */
#include <openssl/opensslv.h>

int main(int argc, char** argv)
{
  (void)argv;
#ifndef LIBRESSL_VERSION_TEXT
  return ((int*)(&LIBRESSL_VERSION_TEXT))[argc];
#else
  (void)argc;
  return 0;
#endif
}

Determining if the backtrace exist failed with the following output:
Change Dir: C:/msys64/home/vagrant/slave/monero-static-win64/build/build/release/CMakeFiles/CMakeTmp

Run Build Command:"C:/msys64/usr/bin/make.exe" "cmTC_898ef/fast"
make[1]: Entering directory '/home/vagrant/slave/monero-static-win64/build/build/release/CMakeFiles/CMakeTmp'
/usr/bin/make -f CMakeFiles/cmTC_898ef.dir/build.make CMakeFiles/cmTC_898ef.dir/build
make[2]: Entering directory '/home/vagrant/slave/monero-static-win64/build/build/release/CMakeFiles/CMakeTmp'
Building C object CMakeFiles/cmTC_898ef.dir/CheckSymbolExists.c.obj

/C/msys64/mingw64/bin/x86_64-w64-mingw32-gcc.exe    -o CMakeFiles/cmTC_898ef.dir/CheckSymbolExists.c.obj   -c /C/msys64/home/vagrant/slave/monero-static-win64/build/build/release/CMakeFiles/CMakeTmp/CheckSymbolExists.c
C:/msys64/home/vagrant/slave/monero-static-win64/build/build/release/CMakeFiles/CMakeTmp/CheckSymbolExists.c:2:10: fatal error: execinfo.h: No such file or directory
 #include <execinfo.h>
          ^~~~~~~~~~~~
compilation terminated.

make[2]: *** [CMakeFiles/cmTC_898ef.dir/build.make:66: CMakeFiles/cmTC_898ef.dir/CheckSymbolExists.c.obj] Error 1
make[2]: Leaving directory '/home/vagrant/slave/monero-static-win64/build/build/release/CMakeFiles/CMakeTmp'
make[1]: *** [Makefile:121: cmTC_898ef/fast] Error 2
make[1]: Leaving directory '/home/vagrant/slave/monero-static-win64/build/build/release/CMakeFiles/CMakeTmp'

File C:/msys64/home/vagrant/slave/monero-static-win64/build/build/release/CMakeFiles/CMakeTmp/CheckSymbolExists.c:
/* */
#include <execinfo.h>

int main(int argc, char** argv)
{
  (void)argv;
#ifndef backtrace
  return ((int*)(&backtrace))[argc];
#else
  (void)argc;
  return 0;
#endif
}

Determining if the -Wl,-z,relro linker flag is supported failed with the following output:
Change Dir: C:/msys64/home/vagrant/slave/monero-static-win64/build/build/release/CMakeFiles/CMakeTmp

Run Build Command:"C:/msys64/usr/bin/make.exe" "cmTC_43059/fast"
make[1]: Entering directory '/home/vagrant/slave/monero-static-win64/build/build/release/CMakeFiles/CMakeTmp'
/usr/bin/make -f CMakeFiles/cmTC_43059.dir/build.make CMakeFiles/cmTC_43059.dir/build
make[2]: Entering directory '/home/vagrant/slave/monero-static-win64/build/build/release/CMakeFiles/CMakeTmp'
Building C object CMakeFiles/cmTC_43059.dir/CheckLinkerFlag.c.obj

/C/msys64/mingw64/bin/x86_64-w64-mingw32-gcc.exe   -Wl,-z,relro    -Wl,-z,relro -o CMakeFiles/cmTC_43059.dir/CheckLinkerFlag.c.obj   -c /C/msys64/home/vagrant/slave/monero-static-win64/build/cmake/CheckLinkerFlag.c
Linking C executable cmTC_43059.exe

/C/msys64/mingw64/bin/cmake.exe -E remove -f CMakeFiles/cmTC_43059.dir/objects.a
ar cr CMakeFiles/cmTC_43059.dir/objects.a "CMakeFiles/cmTC_43059.dir/CheckLinkerFlag.c.obj" 
/C/msys64/mingw64/bin/x86_64-w64-mingw32-gcc.exe -Wl,-z,relro     -Wl,--whole-archive CMakeFiles/cmTC_43059.dir/objects.a -Wl,--no-whole-archive  -o cmTC_43059.exe -Wl,--major-image-version,0,--minor-image-version,0 -lkernel32 -luser32 -lgdi32 -lwinspool -lshell32 -lole32 -loleaut32 -luuid -lcomdlg32 -ladvapi32 
C:/msys64/mingw64/bin/../lib/gcc/x86_64-w64-mingw32/8.2.1/../../../../x86_64-w64-mingw32/bin/ld.exe: unrecognized option '-z'

C:/msys64/mingw64/bin/../lib/gcc/x86_64-w64-mingw32/8.2.1/../../../../x86_64-w64-mingw32/bin/ld.exe: use the --help option for usage information

collect2.exe: error: ld returned 1 exit status
make[2]: *** [CMakeFiles/cmTC_43059.dir/build.make:88: cmTC_43059.exe] Error 1
make[2]: Leaving directory '/home/vagrant/slave/monero-static-win64/build/build/release/CMakeFiles/CMakeTmp'
make[1]: *** [Makefile:121: cmTC_43059/fast] Error 2
make[1]: Leaving directory '/home/vagrant/slave/monero-static-win64/build/build/release/CMakeFiles/CMakeTmp'


Determining if the -Wl,-z,now linker flag is supported failed with the following output:
Change Dir: C:/msys64/home/vagrant/slave/monero-static-win64/build/build/release/CMakeFiles/CMakeTmp

Run Build Command:"C:/msys64/usr/bin/make.exe" "cmTC_065f8/fast"
make[1]: Entering directory '/home/vagrant/slave/monero-static-win64/build/build/release/CMakeFiles/CMakeTmp'
/usr/bin/make -f CMakeFiles/cmTC_065f8.dir/build.make CMakeFiles/cmTC_065f8.dir/build
make[2]: Entering directory '/home/vagrant/slave/monero-static-win64/build/build/release/CMakeFiles/CMakeTmp'
Building C object CMakeFiles/cmTC_065f8.dir/CheckLinkerFlag.c.obj

/C/msys64/mingw64/bin/x86_64-w64-mingw32-gcc.exe   -Wl,-z,now    -Wl,-z,now -o CMakeFiles/cmTC_065f8.dir/CheckLinkerFlag.c.obj   -c /C/msys64/home/vagrant/slave/monero-static-win64/build/cmake/CheckLinkerFlag.c
Linking C executable cmTC_065f8.exe

/C/msys64/mingw64/bin/cmake.exe -E remove -f CMakeFiles/cmTC_065f8.dir/objects.a
ar cr CMakeFiles/cmTC_065f8.dir/objects.a "CMakeFiles/cmTC_065f8.dir/CheckLinkerFlag.c.obj" 
/C/msys64/mingw64/bin/x86_64-w64-mingw32-gcc.exe -Wl,-z,now     -Wl,--whole-archive CMakeFiles/cmTC_065f8.dir/objects.a -Wl,--no-whole-archive  -o cmTC_065f8.exe -Wl,--major-image-version,0,--minor-image-version,0 -lkernel32 -luser32 -lgdi32 -lwinspool -lshell32 -lole32 -loleaut32 -luuid -lcomdlg32 -ladvapi32 
C:/msys64/mingw64/bin/../lib/gcc/x86_64-w64-mingw32/8.2.1/../../../../x86_64-w64-mingw32/bin/ld.exe: unrecognized option '-z'

C:/msys64/mingw64/bin/../lib/gcc/x86_64-w64-mingw32/8.2.1/../../../../x86_64-w64-mingw32/bin/ld.exe: use the --help option for usage information

collect2.exe: error: ld returned 1 exit status
make[2]: *** [CMakeFiles/cmTC_065f8.dir/build.make:88: cmTC_065f8.exe] Error 1
make[2]: Leaving directory '/home/vagrant/slave/monero-static-win64/build/build/release/CMakeFiles/CMakeTmp'
make[1]: *** [Makefile:121: cmTC_065f8/fast] Error 2
make[1]: Leaving directory '/home/vagrant/slave/monero-static-win64/build/build/release/CMakeFiles/CMakeTmp'


Determining if the -Wl,-z,noexecstack linker flag is supported failed with the following output:
Change Dir: C:/msys64/home/vagrant/slave/monero-static-win64/build/build/release/CMakeFiles/CMakeTmp

Run Build Command:"C:/msys64/usr/bin/make.exe" "cmTC_b40d8/fast"
make[1]: Entering directory '/home/vagrant/slave/monero-static-win64/build/build/release/CMakeFiles/CMakeTmp'
/usr/bin/make -f CMakeFiles/cmTC_b40d8.dir/build.make CMakeFiles/cmTC_b40d8.dir/build
make[2]: Entering directory '/home/vagrant/slave/monero-static-win64/build/build/release/CMakeFiles/CMakeTmp'
Building C object CMakeFiles/cmTC_b40d8.dir/CheckLinkerFlag.c.obj

/C/msys64/mingw64/bin/x86_64-w64-mingw32-gcc.exe   -Wl,-z,noexecstack    -Wl,-z,noexecstack -o CMakeFiles/cmTC_b40d8.dir/CheckLinkerFlag.c.obj   -c /C/msys64/home/vagrant/slave/monero-static-win64/build/cmake/CheckLinkerFlag.c
Linking C executable cmTC_b40d8.exe

/C/msys64/mingw64/bin/cmake.exe -E remove -f CMakeFiles/cmTC_b40d8.dir/objects.a
ar cr CMakeFiles/cmTC_b40d8.dir/objects.a "CMakeFiles/cmTC_b40d8.dir/CheckLinkerFlag.c.obj" 
/C/msys64/mingw64/bin/x86_64-w64-mingw32-gcc.exe -Wl,-z,noexecstack     -Wl,--whole-archive CMakeFiles/cmTC_b40d8.dir/objects.a -Wl,--no-whole-archive  -o cmTC_b40d8.exe -Wl,--major-image-version,0,--minor-image-version,0 -lkernel32 -luser32 -lgdi32 -lwinspool -lshell32 -lole32 -loleaut32 -luuid -lcomdlg32 -ladvapi32 
C:/msys64/mingw64/bin/../lib/gcc/x86_64-w64-mingw32/8.2.1/../../../../x86_64-w64-mingw32/bin/ld.exe: unrecognized option '-z'

C:/msys64/mingw64/bin/../lib/gcc/x86_64-w64-mingw32/8.2.1/../../../../x86_64-w64-mingw32/bin/ld.exe: use the --help option for usage information

collect2.exe: error: ld returned 1 exit status
make[2]: *** [CMakeFiles/cmTC_b40d8.dir/build.make:88: cmTC_b40d8.exe] Error 1
make[2]: Leaving directory '/home/vagrant/slave/monero-static-win64/build/build/release/CMakeFiles/CMakeTmp'
make[1]: *** [Makefile:121: cmTC_b40d8/fast] Error 2
make[1]: Leaving directory '/home/vagrant/slave/monero-static-win64/build/build/release/CMakeFiles/CMakeTmp'


Determining if the -Wl,-z,noexecheap linker flag is supported failed with the following output:
Change Dir: C:/msys64/home/vagrant/slave/monero-static-win64/build/build/release/CMakeFiles/CMakeTmp

Run Build Command:"C:/msys64/usr/bin/make.exe" "cmTC_b1766/fast"
make[1]: Entering directory '/home/vagrant/slave/monero-static-win64/build/build/release/CMakeFiles/CMakeTmp'
/usr/bin/make -f CMakeFiles/cmTC_b1766.dir/build.make CMakeFiles/cmTC_b1766.dir/build
make[2]: Entering directory '/home/vagrant/slave/monero-static-win64/build/build/release/CMakeFiles/CMakeTmp'
Building C object CMakeFiles/cmTC_b1766.dir/CheckLinkerFlag.c.obj

/C/msys64/mingw64/bin/x86_64-w64-mingw32-gcc.exe   -Wl,-z,noexecheap    -Wl,-z,noexecheap -o CMakeFiles/cmTC_b1766.dir/CheckLinkerFlag.c.obj   -c /C/msys64/home/vagrant/slave/monero-static-win64/build/cmake/CheckLinkerFlag.c
Linking C executable cmTC_b1766.exe

/C/msys64/mingw64/bin/cmake.exe -E remove -f CMakeFiles/cmTC_b1766.dir/objects.a
ar cr CMakeFiles/cmTC_b1766.dir/objects.a "CMakeFiles/cmTC_b1766.dir/CheckLinkerFlag.c.obj" 
/C/msys64/mingw64/bin/x86_64-w64-mingw32-gcc.exe -Wl,-z,noexecheap     -Wl,--whole-archive CMakeFiles/cmTC_b1766.dir/objects.a -Wl,--no-whole-archive  -o cmTC_b1766.exe -Wl,--major-image-version,0,--minor-image-version,0 -lkernel32 -luser32 -lgdi32 -lwinspool -lshell32 -lole32 -loleaut32 -luuid -lcomdlg32 -ladvapi32 
C:/msys64/mingw64/bin/../lib/gcc/x86_64-w64-mingw32/8.2.1/../../../../x86_64-w64-mingw32/bin/ld.exe: unrecognized option '-z'

C:/msys64/mingw64/bin/../lib/gcc/x86_64-w64-mingw32/8.2.1/../../../../x86_64-w64-mingw32/bin/ld.exe: use the --help option for usage information

collect2.exe: error: ld returned 1 exit status
make[2]: *** [CMakeFiles/cmTC_b1766.dir/build.make:88: cmTC_b1766.exe] Error 1
make[2]: Leaving directory '/home/vagrant/slave/monero-static-win64/build/build/release/CMakeFiles/CMakeTmp'
make[1]: *** [Makefile:121: cmTC_b1766/fast] Error 2
make[1]: Leaving directory '/home/vagrant/slave/monero-static-win64/build/build/release/CMakeFiles/CMakeTmp'


Determining if the function rl_copy_text exists failed with the following output:
Change Dir: C:/msys64/home/vagrant/slave/monero-static-win64/build/build/release/CMakeFiles/CMakeTmp

Run Build Command:"C:/msys64/usr/bin/make.exe" "cmTC_e4046/fast"
make[1]: Entering directory '/home/vagrant/slave/monero-static-win64/build/build/release/CMakeFiles/CMakeTmp'
/usr/bin/make -f CMakeFiles/cmTC_e4046.dir/build.make CMakeFiles/cmTC_e4046.dir/build
make[2]: Entering directory '/home/vagrant/slave/monero-static-win64/build/build/release/CMakeFiles/CMakeTmp'
Building C object CMakeFiles/cmTC_e4046.dir/CheckFunctionExists.c.obj

/C/msys64/mingw64/bin/x86_64-w64-mingw32-gcc.exe   -maes -march=x86-64 -fno-strict-aliasing -std=c11 -D_GNU_SOURCE -m64 -DWIN32_LEAN_AND_MEAN  -Wall -Wextra -Wpointer-arith -Wundef -Wvla -Wwrite-strings -Wno-error=extra -Wno-error=deprecated-declarations -Wno-unused-parameter -Wno-unused-variable -Wno-error=unused-variable -Wno-error=undef -Wno-error=uninitialized -Wlogical-op -Wno-error=maybe-uninitialized -Wno-error=cpp -Wno-error=unused-value -Wno-error=unused-but-set-variable -Waggregate-return -Wnested-externs -Wold-style-definition -Wstrict-prototypes  -fPIC  -U_FORTIFY_SOURCE -D_FORTIFY_SOURCE=1 -Wformat -Wformat-security -mmitigate-rop -fno-strict-aliasing -DCHECK_FUNCTION_EXISTS=rl_copy_text   -o CMakeFiles/cmTC_e4046.dir/CheckFunctionExists.c.obj   -c /C/msys64/mingw64/share/cmake-3.12/Modules/CheckFunctionExists.c
Linking C executable cmTC_e4046.exe

/C/msys64/mingw64/bin/cmake.exe -E remove -f CMakeFiles/cmTC_e4046.dir/objects.a
ar cr CMakeFiles/cmTC_e4046.dir/objects.a "CMakeFiles/cmTC_e4046.dir/CheckFunctionExists.c.obj" 
/C/msys64/mingw64/bin/x86_64-w64-mingw32-gcc.exe  -maes -march=x86-64 -fno-strict-aliasing -std=c11 -D_GNU_SOURCE -m64 -DWIN32_LEAN_AND_MEAN  -Wall -Wextra -Wpointer-arith -Wundef -Wvla -Wwrite-strings -Wno-error=extra -Wno-error=deprecated-declarations -Wno-unused-parameter -Wno-unused-variable -Wno-error=unused-variable -Wno-error=undef -Wno-error=uninitialized -Wlogical-op -Wno-error=maybe-uninitialized -Wno-error=cpp -Wno-error=unused-value -Wno-error=unused-but-set-variable -Waggregate-return -Wnested-externs -Wold-style-definition -Wstrict-prototypes  -fPIC  -U_FORTIFY_SOURCE -D_FORTIFY_SOURCE=1 -Wformat -Wformat-security -mmitigate-rop -fno-strict-aliasing -DCHECK_FUNCTION_EXISTS=rl_copy_text    -Wl,--whole-archive CMakeFiles/cmTC_e4046.dir/objects.a -Wl,--no-whole-archive  -o cmTC_e4046.exe -Wl,--major-image-version,0,--minor-image-version,0 /C/msys64/mingw64/lib/libreadline.a -lkernel32 -luser32 -lgdi32 -lwinspool -lshell32 -lole32 -loleaut32 -luuid -lcomdlg32 -ladvapi32 
C:/msys64/mingw64/lib/libreadline.a(terminal.o):(.text+0x186): undefined reference to `tgetnum'

C:/msys64/mingw64/lib/libreadline.a(terminal.o):(.text+0x2c9): undefined reference to `tgetnum'

C:/msys64/mingw64/lib/libreadline.a(terminal.o):(.text+0x779): undefined reference to `tgetent'

C:/msys64/mingw64/lib/libreadline.a(terminal.o):(.text+0x7bf): undefined reference to `tgetstr'

C:/msys64/mingw64/lib/libreadline.a(terminal.o):(.text+0x81e): undefined reference to `tgetflag'

C:/msys64/mingw64/lib/libreadline.a(terminal.o):(.text+0x86d): undefined reference to `tgetflag'

C:/msys64/mingw64/lib/libreadline.a(terminal.o):(.text+0x988): undefined reference to `tgetflag'

C:/msys64/mingw64/lib/libreadline.a(terminal.o):(.text+0xb87): undefined reference to `tputs'

C:/msys64/mingw64/lib/libreadline.a(terminal.o):(.text+0xc6d): undefined reference to `tputs'

C:/msys64/mingw64/lib/libreadline.a(terminal.o):(.text+0xcb7): undefined reference to `tputs'

C:/msys64/mingw64/lib/libreadline.a(terminal.o):(.text+0xd0d): undefined reference to `tputs'

C:/msys64/mingw64/lib/libreadline.a(terminal.o):(.text+0xd3d): undefined reference to `tputs'

C:/msys64/mingw64/lib/libreadline.a(terminal.o):(.text+0xd80): more undefined references to `tputs' follow

collect2.exe: error: ld returned 1 exit status
make[2]: *** [CMakeFiles/cmTC_e4046.dir/build.make:89: cmTC_e4046.exe] Error 1
make[2]: Leaving directory '/home/vagrant/slave/monero-static-win64/build/build/release/CMakeFiles/CMakeTmp'
make[1]: *** [Makefile:121: cmTC_e4046/fast] Error 2
make[1]: Leaving directory '/home/vagrant/slave/monero-static-win64/build/build/release/CMakeFiles/CMakeTmp'


Determining if the function rl_filename_completion_function exists failed with the following output:
Change Dir: C:/msys64/home/vagrant/slave/monero-static-win64/build/build/release/CMakeFiles/CMakeTmp

Run Build Command:"C:/msys64/usr/bin/make.exe" "cmTC_f9273/fast"
make[1]: Entering directory '/home/vagrant/slave/monero-static-win64/build/build/release/CMakeFiles/CMakeTmp'
/usr/bin/make -f CMakeFiles/cmTC_f9273.dir/build.make CMakeFiles/cmTC_f9273.dir/build
make[2]: Entering directory '/home/vagrant/slave/monero-static-win64/build/build/release/CMakeFiles/CMakeTmp'
Building C object CMakeFiles/cmTC_f9273.dir/CheckFunctionExists.c.obj

/C/msys64/mingw64/bin/x86_64-w64-mingw32-gcc.exe   -maes -march=x86-64 -fno-strict-aliasing -std=c11 -D_GNU_SOURCE -m64 -DWIN32_LEAN_AND_MEAN  -Wall -Wextra -Wpointer-arith -Wundef -Wvla -Wwrite-strings -Wno-error=extra -Wno-error=deprecated-declarations -Wno-unused-parameter -Wno-unused-variable -Wno-error=unused-variable -Wno-error=undef -Wno-error=uninitialized -Wlogical-op -Wno-error=maybe-uninitialized -Wno-error=cpp -Wno-error=unused-value -Wno-error=unused-but-set-variable -Waggregate-return -Wnested-externs -Wold-style-definition -Wstrict-prototypes  -fPIC  -U_FORTIFY_SOURCE -D_FORTIFY_SOURCE=1 -Wformat -Wformat-security -mmitigate-rop -fno-strict-aliasing -DCHECK_FUNCTION_EXISTS=rl_filename_completion_function   -o CMakeFiles/cmTC_f9273.dir/CheckFunctionExists.c.obj   -c /C/msys64/mingw64/share/cmake-3.12/Modules/CheckFunctionExists.c
Linking C executable cmTC_f9273.exe

/C/msys64/mingw64/bin/cmake.exe -E remove -f CMakeFiles/cmTC_f9273.dir/objects.a
ar cr CMakeFiles/cmTC_f9273.dir/objects.a "CMakeFiles/cmTC_f9273.dir/CheckFunctionExists.c.obj" 
/C/msys64/mingw64/bin/x86_64-w64-mingw32-gcc.exe  -maes -march=x86-64 -fno-strict-aliasing -std=c11 -D_GNU_SOURCE -m64 -DWIN32_LEAN_AND_MEAN  -Wall -Wextra -Wpointer-arith -Wundef -Wvla -Wwrite-strings -Wno-error=extra -Wno-error=deprecated-declarations -Wno-unused-parameter -Wno-unused-variable -Wno-error=unused-variable -Wno-error=undef -Wno-error=uninitialized -Wlogical-op -Wno-error=maybe-uninitialized -Wno-error=cpp -Wno-error=unused-value -Wno-error=unused-but-set-variable -Waggregate-return -Wnested-externs -Wold-style-definition -Wstrict-prototypes  -fPIC  -U_FORTIFY_SOURCE -D_FORTIFY_SOURCE=1 -Wformat -Wformat-security -mmitigate-rop -fno-strict-aliasing -DCHECK_FUNCTION_EXISTS=rl_filename_completion_function    -Wl,--whole-archive CMakeFiles/cmTC_f9273.dir/objects.a -Wl,--no-whole-archive  -o cmTC_f9273.exe -Wl,--major-image-version,0,--minor-image-version,0 /C/msys64/mingw64/lib/libreadline.a -lkernel32 -luser32 -lgdi32 -lwinspool -lshell32 -lole32 -loleaut32 -luuid -lcomdlg32 -ladvapi32 
C:/msys64/mingw64/lib/libreadline.a(display.o):(.text+0xa6c): undefined reference to `tputs'

C:/msys64/mingw64/lib/libreadline.a(display.o):(.text+0xb8e): undefined reference to `tputs'

C:/msys64/mingw64/lib/libreadline.a(display.o):(.text+0xbe2): undefined reference to `tputs'

C:/msys64/mingw64/lib/libreadline.a(display.o):(.text+0x19a5): undefined reference to `tputs'

C:/msys64/mingw64/lib/libreadline.a(display.o):(.text+0x2b47): undefined reference to `tputs'

C:/msys64/mingw64/lib/libreadline.a(display.o):(.text+0x2c4e): more undefined references to `tputs' follow

C:/msys64/mingw64/lib/libreadline.a(terminal.o):(.text+0x186): undefined reference to `tgetnum'

C:/msys64/mingw64/lib/libreadline.a(terminal.o):(.text+0x2c9): undefined reference to `tgetnum'

C:/msys64/mingw64/lib/libreadline.a(terminal.o):(.text+0x779): undefined reference to `tgetent'

C:/msys64/mingw64/lib/libreadline.a(terminal.o):(.text+0x7bf): undefined reference to `tgetstr'

C:/msys64/mingw64/lib/libreadline.a(terminal.o):(.text+0x81e): undefined reference to `tgetflag'

C:/msys64/mingw64/lib/libreadline.a(terminal.o):(.text+0x86d): undefined reference to `tgetflag'

C:/msys64/mingw64/lib/libreadline.a(terminal.o):(.text+0x988): undefined reference to `tgetflag'

C:/msys64/mingw64/lib/libreadline.a(terminal.o):(.text+0xb87): undefined reference to `tputs'

C:/msys64/mingw64/lib/libreadline.a(terminal.o):(.text+0xc6d): undefined reference to `tputs'

C:/msys64/mingw64/lib/libreadline.a(terminal.o):(.text+0xcb7): undefined reference to `tputs'

C:/msys64/mingw64/lib/libreadline.a(terminal.o):(.text+0xd0d): undefined reference to `tputs'

C:/msys64/mingw64/lib/libreadline.a(terminal.o):(.text+0xd3d): undefined reference to `tputs'

C:/msys64/mingw64/lib/libreadline.a(terminal.o):(.text+0xd80): more undefined references to `tputs' follow

collect2.exe: error: ld returned 1 exit status
make[2]: *** [CMakeFiles/cmTC_f9273.dir/build.make:89: cmTC_f9273.exe] Error 1
make[2]: Leaving directory '/home/vagrant/slave/monero-static-win64/build/build/release/CMakeFiles/CMakeTmp'
make[1]: *** [Makefile:121: cmTC_f9273/fast] Error 2
make[1]: Leaving directory '/home/vagrant/slave/monero-static-win64/build/build/release/CMakeFiles/CMakeTmp'